{"text_format":"1","workbook":"xlsx","n_sheets":8,"sheets":["Nom Prénom Equipe","Page principal","Classement après 1ère partie","Classement après 2ème partie","Classement après 3ème partie","Tirage des tables","Classement final","Tirage 1,2 et 3 ème partie"],"not_rendered":{"charts":0,"images":0,"macros":1,"external_links":0,"defined_names":0,"comments":0,"pivot_tables":0},"unopened":[],"bounds":{"document_bytes":16777216,"sheet_cells":100000,"rows_first":2000,"rows_last":500,"rows_between":2000,"halvings":0,"cell_chars":16384,"cell_head_chars":4096},"cells_cut":0,"cells_raw":0,"read":"whole","date_system":"1900"}

{"sheet":"Nom Prénom Equipe","index":0,"n_rows":91,"n_cols":4,"rows_kept":91,"cut":false,"hidden":false,"merged":[]}
["Numéro d'équipe","Noms participants","Nom prénom adresse 1er joueur","Nom prénom adresse 2ème joueur"]
["Equipe N°1"]
["Equipe N°2"]
["Equipe N°3"]
["Equipe N°4"]
["Equipe N°5"]
["Equipe N°6"]
["Equipe N°7"]
["Equipe N°8"]
["Equipe N°9"]
["Equipe N°10"]
["Equipe N°11"]
["Equipe N°12"]
["Equipe N°13"]
["Equipe N°14"]
["Equipe N°15"]
["Equipe N°16"]
["Equipe N°17"]
["Equipe N°18"]
["Equipe N°19"]
["Equipe N°20"]
["Equipe N°21"]
["Equipe N°22"]
["Equipe N°23"]
["Equipe N°24"]
["Equipe N°25"]
["Equipe N°26"]
["Equipe N°27"]
["Equipe N°28"]
["Equipe N°29"]
{"$rows_left_out":62}
{"sheet":"Page principal","index":1,"n_rows":101,"n_cols":14,"rows_kept":101,"cut":false,"hidden":false,"merged":[[90,12,91,12],[3,11,4,11],[84,12,85,12],[86,12,87,12],[88,12,89,12],[76,12,77,12],[78,12,79,12],[80,12,81,12],[82,12,83,12],[68,12,69,12],[70,12,71,12],[72,12,73,12],[74,12,75,12],[60,12,61,12],[62,12,63,12],[64,12,65,12],[66,12,67,12],[52,12,53,12],[54,12,55,12],[56,12,57,12],[58,12,59,12],[44,12,45,12],[46,12,47,12],[48,12,49,12],[50,12,51,12],[36,12,37,12],[38,12,39,12],[40,12,41,12],[42,12,43,12],[28,12,29,12],[30,12,31,12],[32,12,33,12],[34,12,35,12],[20,12,21,12],[22,12,23,12],[24,12,25,12],[26,12,27,12],[89,11,90,11],[2,12,3,12],[4,12,5,12],[6,12,7,12],[8,12,9,12],[10,12,11,12],[12,12,13,12],[14,12,15,12],[16,12,17,12],[18,12,19,12],[81,11,82,11],[83,11,84,11],[65,11,66,11],[67,11,68,11],[69,11,70,11],[71,11,72,11],[87,11,88,11],[73,11,74,11],[75,11,76,11],[77,11,78,11],[79,11,80,11],[57,11,58,11],[59,11,60,11],[61,11,62,11],[63,11,64,11],[85,11,86,11],[49,11,50,11],[51,11,52,11],[53,11,54,11],[55,11,56,11],[41,11,42,11],[43,11,44,11],[45,11,46,11],[47,11,48,11],[33,11,34,11],[35,11,36,11],[37,11,38,11],[39,11,40,11],[7,11,8,11],[25,11,26,11],[27,11,28,11],[29,11,30,11],[31,11,32,11],[17,11,18,11],[19,11,20,11],[21,11,22,11],[23,11,24,11],[18,8,20,10],[12,8,14,10],[6,8,8,10],[0,8,2,10],[9,11,10,11],[11,11,12,11],[13,11,14,11],[15,11,16,11],[1,11,2,11],[5,11,6,11]]}
["Numéro d'équipe","1ère partie","2ème partie ","Total intermediaire","3ème partie","Totale des 3 parties","4ème partie","Totale des 4 parties","classement après 1ère",null,null,"Somme partie 1","Somme partie 2","Somme partie 3"]
["Equipe N°1",null,null,{"$f":"SUM(B2:C2)","v":0},null,{"$f":"SUM(D2:E2)","v":0},null,{"$f":"SUM(F2:G2)","v":0},null,null,null,{"$f":"IF(B2+B3=2512,\"ok\",\"erreur\")","v":"erreur"},{"$f":"IF(C2+C49=2512,\"ok\",\"erreur\")","v":"erreur"},{"$f":"IF(E2+E7=2512,\"ok\",\"erreur\")","v":"erreur"}]
["Equipe N°2",null,null,0,null,0,null,0,null,null,null,null,{"$f":"IF(C3+C4=2512,\"ok\",\"erreur\")","v":"erreur"}," "]
["Equipe N°3",null,null,0,null,0,null,0,null,null,null,{"$f":"IF(B4+B5=2512,\"ok\",\"erreur\")","v":"erreur"},null,{"$f":"IF(E4+E49=2512,\"ok\",\"erreur\")","v":"erreur"}]
["Equipe N°4",null,null,0,null,0,null,0,null,null,null,null,{"$f":"IF(C5+C6=2512,\"ok\",\"erreur\")","v":"erreur"}]
["Equipe N°5",null,null,0,null,0,null,0,null,null,null,{"$f":"IF(B6+B7=2512,\"ok\",\"erreur\")","v":"erreur"},null,{"$f":"IF(E6+E3=2512,\"ok\",\"erreur\")","v":"erreur"}]
["Equipe N°6",null,null,0,null,0,null,0,"classement après 2ème",null,null,null,{"$f":"IF(C7+C8=2512,\"ok\",\"erreur\")","v":"erreur"}]
["Equipe N°7",null,null,0,null,0,null,0,null,null,null,{"$f":"IF(B8+B9=2512,\"ok\",\"erreur\")","v":"erreur"},null,{"$f":"IF(E8+E5=2512,\"ok\",\"erreur\")","v":"erreur"}]
["Equipe N°8",null,null,0,null,0,null,0,null,null,null,null,{"$f":"IF(C9+C10=2512,\"ok\",\"erreur\")","v":"erreur"}]
["Equipe N°9",null,null,0,null,0,null,0,null,null,null,{"$f":"IF(B10+B11=2512,\"ok\",\"erreur\")","v":"erreur"},null,{"$f":"IF(E10+E7=2512,\"ok\",\"erreur\")","v":"erreur"}]
["Equipe N°10",null,null,0,null,0,null,0,null,null,null,null,{"$f":"IF(C11+C12=2512,\"ok\",\"erreur\")","v":"erreur"}]
["Equipe N°11",null,null,0,null,0,null,0,null,null,null,{"$f":"IF(B12+B13=2512,\"ok\",\"erreur\")","v":"erreur"},null,{"$f":"IF(E12+E9=2512,\"ok\",\"erreur\")","v":"erreur"}]
["Equipe N°12",null,null,0,null,0,null,0,"classement après 3ème",null,null,null,{"$f":"IF(C13+C14=2512,\"ok\",\"erreur\")","v":"erreur"}]
["Equipe N°13",null,null,0,null,0,null,0,null,null,null,{"$f":"IF(B14+B15=2512,\"ok\",\"erreur\")","v":"erreur"},null,{"$f":"IF(E14+E11=2512,\"ok\",\"erreur\")","v":"erreur"}]
["Equipe N°14",null,null,0,null,0,null,0,null,null,null,null,{"$f":"IF(C15+C16=2512,\"ok\",\"erreur\")","v":"erreur"}]
["Equipe N°15",null,null,0,null,0,null,0,null,null,null,{"$f":"IF(B16+B17=2512,\"ok\",\"erreur\")","v":"erreur"},null,{"$f":"IF(E16+E13=2512,\"ok\",\"erreur\")","v":"erreur"}]
["Equipe N°16",null,null,0,null,0,null,0,null,null,null,null,{"$f":"IF(C17+C18=2512,\"ok\",\"erreur\")","v":"erreur"}]
["Equipe N°17",null,null,0,null,0,null,0,null,null,null,{"$f":"IF(B18+B19=2512,\"ok\",\"erreur\")","v":"erreur"},null,{"$f":"IF(E18+E15=2512,\"ok\",\"erreur\")","v":"erreur"}]
["Equipe N°18",null,null,0,null,0,null,0,"classement final",null,null,null,{"$f":"IF(C19+C20=2512,\"ok\",\"erreur\")","v":"erreur"}]
["Equipe N°19",null,null,0,null,0,null,0,null,null,null,{"$f":"IF(B20+B21=2512,\"ok\",\"erreur\")","v":"erreur"},null,{"$f":"IF(E20+E17=2512,\"ok\",\"erreur\")","v":"erreur"}]
["Equipe N°20",null,null,0,null,0,null,0,null,null,null,null,{"$f":"IF(C21+C22=2512,\"ok\",\"erreur\")","v":"erreur"}]
["Equipe N°21",null,null,0,null,0,null,0,null,null,null,{"$f":"IF(B22+B23=2512,\"ok\",\"erreur\")","v":"erreur"},null,{"$f":"IF(E22+E19=2512,\"ok\",\"erreur\")","v":"erreur"}]
["Equipe N°22",null,null,0,null,0,null,0,null,null,null,null,{"$f":"IF(C23+C24=2512,\"ok\",\"erreur\")","v":"erreur"}]
["Equipe N°23",null,null,0,null,0,null,0,null,null,null,{"$f":"IF(B24+B25=2512,\"ok\",\"erreur\")","v":"erreur"},null,{"$f":"IF(E24+E21=2512,\"ok\",\"erreur\")","v":"erreur"}]
["Equipe N°24",null,null,0,null,0,null,0,null,null,null,null,{"$f":"IF(C25+C26=2512,\"ok\",\"erreur\")","v":"erreur"}]
["Equipe N°25",null,null,0,null,0,null,0,null,null,null,{"$f":"IF(B26+B27=2512,\"ok\",\"erreur\")","v":"erreur"},null,{"$f":"IF(E26+E23=2512,\"ok\",\"erreur\")","v":"erreur"}]
["Equipe N°26",null,null,0,null,0,null,0,null,null,null,null,{"$f":"IF(C27+C28=2512,\"ok\",\"erreur\")","v":"erreur"}]
["Equipe N°27",null,null,0,null,0,null,0,null,null,null,{"$f":"IF(B28+B29=2512,\"ok\",\"erreur\")","v":"erreur"},null,{"$f":"IF(E28+E25=2512,\"ok\",\"erreur\")","v":"erreur"}]
["Equipe N°28",null,null,0,null,0,null,0,null,null,null,null,{"$f":"IF(C29+C30=2512,\"ok\",\"erreur\")","v":"erreur"}]
["Equipe N°29",null,null,0,null,0,null,0,null,null,null,{"$f":"IF(B30+B31=2512,\"ok\",\"erreur\")","v":"erreur"},null,{"$f":"IF(E30+E27=2512,\"ok\",\"erreur\")","v":"erreur"}]
{"$rows_left_out":72}
{"sheet":"Classement après 1ère partie","index":2,"n_rows":101,"n_cols":4,"rows_kept":101,"cut":false,"hidden":false,"merged":[]}
["Numéro d'équipe","Points","Noms équipe","Rang"]
["Equipe N°1",0,{"$f":"VLOOKUP(A2,'Nom Prénom Equipe'!A:B,2,FALSE)","v":0},1]
["Equipe N°2",0,{"$f":"VLOOKUP(A3,'Nom Prénom Equipe'!A:B,2,FALSE)","v":0},2]
["Equipe N°3",0,{"$f":"VLOOKUP(A4,'Nom Prénom Equipe'!A:B,2,FALSE)","v":0},3]
["Equipe N°4",0,{"$f":"VLOOKUP(A5,'Nom Prénom Equipe'!A:B,2,FALSE)","v":0},4]
["Equipe N°5",0,{"$f":"VLOOKUP(A6,'Nom Prénom Equipe'!A:B,2,FALSE)","v":0},5]
["Equipe N°6",0,{"$f":"VLOOKUP(A7,'Nom Prénom Equipe'!A:B,2,FALSE)","v":0},6]
["Equipe N°7",0,{"$f":"VLOOKUP(A8,'Nom Prénom Equipe'!A:B,2,FALSE)","v":0},7]
["Equipe N°8",0,{"$f":"VLOOKUP(A9,'Nom Prénom Equipe'!A:B,2,FALSE)","v":0},8]
["Equipe N°9",0,{"$f":"VLOOKUP(A10,'Nom Prénom Equipe'!A:B,2,FALSE)","v":0},9]
["Equipe N°10",0,{"$f":"VLOOKUP(A11,'Nom Prénom Equipe'!A:B,2,FALSE)","v":0},10]
["Equipe N°11",0,{"$f":"VLOOKUP(A12,'Nom Prénom Equipe'!A:B,2,FALSE)","v":0},11]
["Equipe N°12",0,{"$f":"VLOOKUP(A13,'Nom Prénom Equipe'!A:B,2,FALSE)","v":0},12]
["Equipe N°13",0,{"$f":"VLOOKUP(A14,'Nom Prénom Equipe'!A:B,2,FALSE)","v":0},13]
["Equipe N°14",0,{"$f":"VLOOKUP(A15,'Nom Prénom Equipe'!A:B,2,FALSE)","v":0},14]
["Equipe N°15",0,{"$f":"VLOOKUP(A16,'Nom Prénom Equipe'!A:B,2,FALSE)","v":0},15]
["Equipe N°16",0,{"$f":"VLOOKUP(A17,'Nom Prénom Equipe'!A:B,2,FALSE)","v":0},16]
["Equipe N°17",0,{"$f":"VLOOKUP(A18,'Nom Prénom Equipe'!A:B,2,FALSE)","v":0},17]
["Equipe N°18",0,{"$f":"VLOOKUP(A19,'Nom Prénom Equipe'!A:B,2,FALSE)","v":0},18]
["Equipe N°19",0,{"$f":"VLOOKUP(A20,'Nom Prénom Equipe'!A:B,2,FALSE)","v":0},19]
["Equipe N°20",0,{"$f":"VLOOKUP(A21,'Nom Prénom Equipe'!A:B,2,FALSE)","v":0},20]
["Equipe N°21",0,{"$f":"VLOOKUP(A22,'Nom Prénom Equipe'!A:B,2,FALSE)","v":0},21]
["Equipe N°22",0,{"$f":"VLOOKUP(A23,'Nom Prénom Equipe'!A:B,2,FALSE)","v":0},22]
["Equipe N°23",0,{"$f":"VLOOKUP(A24,'Nom Prénom Equipe'!A:B,2,FALSE)","v":0},23]
["Equipe N°24",0,{"$f":"VLOOKUP(A25,'Nom Prénom Equipe'!A:B,2,FALSE)","v":0},24]
["Equipe N°25",0,{"$f":"VLOOKUP(A26,'Nom Prénom Equipe'!A:B,2,FALSE)","v":0},25]
["Equipe N°26",0,{"$f":"VLOOKUP(A27,'Nom Prénom Equipe'!A:B,2,FALSE)","v":0},26]
["Equipe N°27",0,{"$f":"VLOOKUP(A28,'Nom Prénom Equipe'!A:B,2,FALSE)","v":0},27]
["Equipe N°28",0,{"$f":"VLOOKUP(A29,'Nom Prénom Equipe'!A:B,2,FALSE)","v":0},28]
["Equipe N°29",0,{"$f":"VLOOKUP(A30,'Nom Prénom Equipe'!A:B,2,FALSE)","v":0},29]
{"$rows_left_out":72}
{"sheet":"Classement après 2ème partie","index":3,"n_rows":101,"n_cols":4,"rows_kept":101,"cut":false,"hidden":false,"merged":[]}
["Numéro d'équipe","Points","Noms équipe","Rang"]
["Equipe N°1",0,{"$f":"VLOOKUP(A2,'Nom Prénom Equipe'!A:B,2,FALSE)","v":0},1]
["Equipe N°2",0,{"$f":"VLOOKUP(A3,'Nom Prénom Equipe'!A:B,2,FALSE)","v":0},2]
["Equipe N°3",0,{"$f":"VLOOKUP(A4,'Nom Prénom Equipe'!A:B,2,FALSE)","v":0},3]
["Equipe N°4",0,{"$f":"VLOOKUP(A5,'Nom Prénom Equipe'!A:B,2,FALSE)","v":0},4]
["Equipe N°5",0,{"$f":"VLOOKUP(A6,'Nom Prénom Equipe'!A:B,2,FALSE)","v":0},5]
["Equipe N°6",0,{"$f":"VLOOKUP(A7,'Nom Prénom Equipe'!A:B,2,FALSE)","v":0},6]
["Equipe N°7",0,{"$f":"VLOOKUP(A8,'Nom Prénom Equipe'!A:B,2,FALSE)","v":0},7]
["Equipe N°8",0,{"$f":"VLOOKUP(A9,'Nom Prénom Equipe'!A:B,2,FALSE)","v":0},8]
["Equipe N°9",0,{"$f":"VLOOKUP(A10,'Nom Prénom Equipe'!A:B,2,FALSE)","v":0},9]
["Equipe N°10",0,{"$f":"VLOOKUP(A11,'Nom Prénom Equipe'!A:B,2,FALSE)","v":0},10]
["Equipe N°11",0,{"$f":"VLOOKUP(A12,'Nom Prénom Equipe'!A:B,2,FALSE)","v":0},11]
["Equipe N°12",0,{"$f":"VLOOKUP(A13,'Nom Prénom Equipe'!A:B,2,FALSE)","v":0},12]
["Equipe N°13",0,{"$f":"VLOOKUP(A14,'Nom Prénom Equipe'!A:B,2,FALSE)","v":0},13]
["Equipe N°14",0,{"$f":"VLOOKUP(A15,'Nom Prénom Equipe'!A:B,2,FALSE)","v":0},14]
["Equipe N°15",0,{"$f":"VLOOKUP(A16,'Nom Prénom Equipe'!A:B,2,FALSE)","v":0},15]
["Equipe N°16",0,{"$f":"VLOOKUP(A17,'Nom Prénom Equipe'!A:B,2,FALSE)","v":0},16]
["Equipe N°17",0,{"$f":"VLOOKUP(A18,'Nom Prénom Equipe'!A:B,2,FALSE)","v":0},17]
["Equipe N°18",0,{"$f":"VLOOKUP(A19,'Nom Prénom Equipe'!A:B,2,FALSE)","v":0},18]
["Equipe N°19",0,{"$f":"VLOOKUP(A20,'Nom Prénom Equipe'!A:B,2,FALSE)","v":0},19]
["Equipe N°20",0,{"$f":"VLOOKUP(A21,'Nom Prénom Equipe'!A:B,2,FALSE)","v":0},20]
["Equipe N°21",0,{"$f":"VLOOKUP(A22,'Nom Prénom Equipe'!A:B,2,FALSE)","v":0},21]
["Equipe N°22",0,{"$f":"VLOOKUP(A23,'Nom Prénom Equipe'!A:B,2,FALSE)","v":0},22]
["Equipe N°23",0,{"$f":"VLOOKUP(A24,'Nom Prénom Equipe'!A:B,2,FALSE)","v":0},23]
["Equipe N°24",0,{"$f":"VLOOKUP(A25,'Nom Prénom Equipe'!A:B,2,FALSE)","v":0},24]
["Equipe N°25",0,{"$f":"VLOOKUP(A26,'Nom Prénom Equipe'!A:B,2,FALSE)","v":0},25]
["Equipe N°26",0,{"$f":"VLOOKUP(A27,'Nom Prénom Equipe'!A:B,2,FALSE)","v":0},26]
["Equipe N°27",0,{"$f":"VLOOKUP(A28,'Nom Prénom Equipe'!A:B,2,FALSE)","v":0},27]
["Equipe N°28",0,{"$f":"VLOOKUP(A29,'Nom Prénom Equipe'!A:B,2,FALSE)","v":0},28]
["Equipe N°29",0,{"$f":"VLOOKUP(A30,'Nom Prénom Equipe'!A:B,2,FALSE)","v":0},29]
{"$rows_left_out":72}
{"sheet":"Classement après 3ème partie","index":4,"n_rows":101,"n_cols":5,"rows_kept":101,"cut":false,"hidden":false,"merged":[[23,4,24,4],[1,4,2,4],[3,4,4,4],[5,4,6,4],[7,4,8,4],[9,4,10,4],[11,4,12,4],[13,4,14,4],[15,4,16,4],[17,4,18,4],[19,4,20,4],[21,4,22,4],[47,4,48,4],[25,4,26,4],[27,4,28,4],[29,4,30,4],[31,4,32,4],[33,4,34,4],[35,4,36,4],[37,4,38,4],[39,4,40,4],[41,4,42,4],[43,4,44,4],[45,4,46,4]]}
["Numéro d'équipe","Points","Noms équipe","Rang","Tables"]
["Equipe N°1",0,{"$f":"VLOOKUP(A2,'Nom Prénom Equipe'!A:B,2,FALSE)","v":0},1,1]
["Equipe N°2",0,{"$f":"VLOOKUP(A3,'Nom Prénom Equipe'!A:B,2,FALSE)","v":0},2]
["Equipe N°3",0,{"$f":"VLOOKUP(A4,'Nom Prénom Equipe'!A:B,2,FALSE)","v":0},3,3]
["Equipe N°4",0,{"$f":"VLOOKUP(A5,'Nom Prénom Equipe'!A:B,2,FALSE)","v":0},4]
["Equipe N°5",0,{"$f":"VLOOKUP(A6,'Nom Prénom Equipe'!A:B,2,FALSE)","v":0},5,5]
["Equipe N°6",0,{"$f":"VLOOKUP(A7,'Nom Prénom Equipe'!A:B,2,FALSE)","v":0},6]
["Equipe N°7",0,{"$f":"VLOOKUP(A8,'Nom Prénom Equipe'!A:B,2,FALSE)","v":0},7,7]
["Equipe N°8",0,{"$f":"VLOOKUP(A9,'Nom Prénom Equipe'!A:B,2,FALSE)","v":0},8]
["Equipe N°9",0,{"$f":"VLOOKUP(A10,'Nom Prénom Equipe'!A:B,2,FALSE)","v":0},9,9]
["Equipe N°10",0,{"$f":"VLOOKUP(A11,'Nom Prénom Equipe'!A:B,2,FALSE)","v":0},10]
["Equipe N°11",0,{"$f":"VLOOKUP(A12,'Nom Prénom Equipe'!A:B,2,FALSE)","v":0},11,11]
["Equipe N°12",0,{"$f":"VLOOKUP(A13,'Nom Prénom Equipe'!A:B,2,FALSE)","v":0},12]
["Equipe N°13",0,{"$f":"VLOOKUP(A14,'Nom Prénom Equipe'!A:B,2,FALSE)","v":0},13,13]
["Equipe N°14",0,{"$f":"VLOOKUP(A15,'Nom Prénom Equipe'!A:B,2,FALSE)","v":0},14]
["Equipe N°15",0,{"$f":"VLOOKUP(A16,'Nom Prénom Equipe'!A:B,2,FALSE)","v":0},15,15]
["Equipe N°16",0,{"$f":"VLOOKUP(A17,'Nom Prénom Equipe'!A:B,2,FALSE)","v":0},16]
["Equipe N°17",0,{"$f":"VLOOKUP(A18,'Nom Prénom Equipe'!A:B,2,FALSE)","v":0},17,17]
["Equipe N°18",0,{"$f":"VLOOKUP(A19,'Nom Prénom Equipe'!A:B,2,FALSE)","v":0},18]
["Equipe N°19",0,{"$f":"VLOOKUP(A20,'Nom Prénom Equipe'!A:B,2,FALSE)","v":0},19,19]
["Equipe N°20",0,{"$f":"VLOOKUP(A21,'Nom Prénom Equipe'!A:B,2,FALSE)","v":0},20]
["Equipe N°21",0,{"$f":"VLOOKUP(A22,'Nom Prénom Equipe'!A:B,2,FALSE)","v":0},21,21]
["Equipe N°22",0,{"$f":"VLOOKUP(A23,'Nom Prénom Equipe'!A:B,2,FALSE)","v":0},22]
["Equipe N°23",0,{"$f":"VLOOKUP(A24,'Nom Prénom Equipe'!A:B,2,FALSE)","v":0},23,23]
["Equipe N°24",0,{"$f":"VLOOKUP(A25,'Nom Prénom Equipe'!A:B,2,FALSE)","v":0},24]
["Equipe N°25",0,{"$f":"VLOOKUP(A26,'Nom Prénom Equipe'!A:B,2,FALSE)","v":0},25,25]
["Equipe N°26",0,{"$f":"VLOOKUP(A27,'Nom Prénom Equipe'!A:B,2,FALSE)","v":0},26]
["Equipe N°27",0,{"$f":"VLOOKUP(A28,'Nom Prénom Equipe'!A:B,2,FALSE)","v":0},27,27]
["Equipe N°28",0,{"$f":"VLOOKUP(A29,'Nom Prénom Equipe'!A:B,2,FALSE)","v":0},28]
["Equipe N°29",0,{"$f":"VLOOKUP(A30,'Nom Prénom Equipe'!A:B,2,FALSE)","v":0},29,29]
{"$rows_left_out":72}
{"sheet":"Tirage des tables","index":5,"n_rows":101,"n_cols":5,"rows_kept":101,"cut":false,"hidden":false,"merged":[[23,1,24,1],[1,1,2,1],[3,1,4,1],[5,1,6,1],[7,1,8,1],[9,1,10,1],[11,1,12,1],[13,1,14,1],[15,1,16,1],[17,1,18,1],[19,1,20,1],[21,1,22,1],[47,1,48,1],[25,1,26,1],[27,1,28,1],[29,1,30,1],[31,1,32,1],[33,1,34,1],[35,1,36,1],[37,1,38,1],[39,1,40,1],[41,1,42,1],[43,1,44,1],[45,1,46,1]]}
["Numéro d'équipe","Tables","Noms équipe","Rang"," "]
["Equipe N°1",1,{"$f":"VLOOKUP(A2,'Nom Prénom Equipe'!A:B,2,FALSE)","v":0},1]
["Equipe N°2",null,{"$f":"VLOOKUP(A3,'Nom Prénom Equipe'!A:B,2,FALSE)","v":0},2]
["Equipe N°3",3,{"$f":"VLOOKUP(A4,'Nom Prénom Equipe'!A:B,2,FALSE)","v":0},3]
["Equipe N°4",null,{"$f":"VLOOKUP(A5,'Nom Prénom Equipe'!A:B,2,FALSE)","v":0},4]
["Equipe N°5",5,{"$f":"VLOOKUP(A6,'Nom Prénom Equipe'!A:B,2,FALSE)","v":0},5]
["Equipe N°6",null,{"$f":"VLOOKUP(A7,'Nom Prénom Equipe'!A:B,2,FALSE)","v":0},6]
["Equipe N°7",7,{"$f":"VLOOKUP(A8,'Nom Prénom Equipe'!A:B,2,FALSE)","v":0},7]
["Equipe N°8",null,{"$f":"VLOOKUP(A9,'Nom Prénom Equipe'!A:B,2,FALSE)","v":0},8]
["Equipe N°9",9,{"$f":"VLOOKUP(A10,'Nom Prénom Equipe'!A:B,2,FALSE)","v":0},9]
["Equipe N°10",null,{"$f":"VLOOKUP(A11,'Nom Prénom Equipe'!A:B,2,FALSE)","v":0},10]
["Equipe N°11",11,{"$f":"VLOOKUP(A12,'Nom Prénom Equipe'!A:B,2,FALSE)","v":0},11]
["Equipe N°12",null,{"$f":"VLOOKUP(A13,'Nom Prénom Equipe'!A:B,2,FALSE)","v":0},12]
["Equipe N°13",13,{"$f":"VLOOKUP(A14,'Nom Prénom Equipe'!A:B,2,FALSE)","v":0},13]
["Equipe N°14",null,{"$f":"VLOOKUP(A15,'Nom Prénom Equipe'!A:B,2,FALSE)","v":0},14]
["Equipe N°15",15,{"$f":"VLOOKUP(A16,'Nom Prénom Equipe'!A:B,2,FALSE)","v":0},15]
["Equipe N°16",null,{"$f":"VLOOKUP(A17,'Nom Prénom Equipe'!A:B,2,FALSE)","v":0},16]
["Equipe N°17",17,{"$f":"VLOOKUP(A18,'Nom Prénom Equipe'!A:B,2,FALSE)","v":0},17]
["Equipe N°18",null,{"$f":"VLOOKUP(A19,'Nom Prénom Equipe'!A:B,2,FALSE)","v":0},18]
["Equipe N°19",19,{"$f":"VLOOKUP(A20,'Nom Prénom Equipe'!A:B,2,FALSE)","v":0},19]
["Equipe N°20",null,{"$f":"VLOOKUP(A21,'Nom Prénom Equipe'!A:B,2,FALSE)","v":0},20]
["Equipe N°21",21,{"$f":"VLOOKUP(A22,'Nom Prénom Equipe'!A:B,2,FALSE)","v":0},21]
["Equipe N°22",null,{"$f":"VLOOKUP(A23,'Nom Prénom Equipe'!A:B,2,FALSE)","v":0},22]
["Equipe N°23",23,{"$f":"VLOOKUP(A24,'Nom Prénom Equipe'!A:B,2,FALSE)","v":0},23]
["Equipe N°24",null,{"$f":"VLOOKUP(A25,'Nom Prénom Equipe'!A:B,2,FALSE)","v":0},24]
["Equipe N°25",25,{"$f":"VLOOKUP(A26,'Nom Prénom Equipe'!A:B,2,FALSE)","v":0},25]
["Equipe N°26",null,{"$f":"VLOOKUP(A27,'Nom Prénom Equipe'!A:B,2,FALSE)","v":0},26]
["Equipe N°27",27,{"$f":"VLOOKUP(A28,'Nom Prénom Equipe'!A:B,2,FALSE)","v":0},27]
["Equipe N°28",null,{"$f":"VLOOKUP(A29,'Nom Prénom Equipe'!A:B,2,FALSE)","v":0},28]
["Equipe N°29",29,{"$f":"VLOOKUP(A30,'Nom Prénom Equipe'!A:B,2,FALSE)","v":0},29]
{"$rows_left_out":72}
{"sheet":"Classement final","index":6,"n_rows":101,"n_cols":4,"rows_kept":101,"cut":false,"hidden":false,"merged":[]}
["Numéro d'équipe","Points","Noms équipe","Rang"]
["Equipe N°1",0,{"$f":"VLOOKUP(A2,'Nom Prénom Equipe'!A:B,2,FALSE)","v":0},1]
["Equipe N°2",0,{"$f":"VLOOKUP(A3,'Nom Prénom Equipe'!A:B,2,FALSE)","v":0},2]
["Equipe N°3",0,{"$f":"VLOOKUP(A4,'Nom Prénom Equipe'!A:B,2,FALSE)","v":0},3]
["Equipe N°4",0,{"$f":"VLOOKUP(A5,'Nom Prénom Equipe'!A:B,2,FALSE)","v":0},4]
["Equipe N°5",0,{"$f":"VLOOKUP(A6,'Nom Prénom Equipe'!A:B,2,FALSE)","v":0},5]
["Equipe N°6",0,{"$f":"VLOOKUP(A7,'Nom Prénom Equipe'!A:B,2,FALSE)","v":0},6]
["Equipe N°7",0,{"$f":"VLOOKUP(A8,'Nom Prénom Equipe'!A:B,2,FALSE)","v":0},7]
["Equipe N°8",0,{"$f":"VLOOKUP(A9,'Nom Prénom Equipe'!A:B,2,FALSE)","v":0},8]
["Equipe N°9",0,{"$f":"VLOOKUP(A10,'Nom Prénom Equipe'!A:B,2,FALSE)","v":0},9]
["Equipe N°10",0,{"$f":"VLOOKUP(A11,'Nom Prénom Equipe'!A:B,2,FALSE)","v":0},10]
["Equipe N°11",0,{"$f":"VLOOKUP(A12,'Nom Prénom Equipe'!A:B,2,FALSE)","v":0},11]
["Equipe N°12",0,{"$f":"VLOOKUP(A13,'Nom Prénom Equipe'!A:B,2,FALSE)","v":0},12]
["Equipe N°13",0,{"$f":"VLOOKUP(A14,'Nom Prénom Equipe'!A:B,2,FALSE)","v":0},13]
["Equipe N°14",0,{"$f":"VLOOKUP(A15,'Nom Prénom Equipe'!A:B,2,FALSE)","v":0},14]
["Equipe N°15",0,{"$f":"VLOOKUP(A16,'Nom Prénom Equipe'!A:B,2,FALSE)","v":0},15]
["Equipe N°16",0,{"$f":"VLOOKUP(A17,'Nom Prénom Equipe'!A:B,2,FALSE)","v":0},16]
["Equipe N°17",0,{"$f":"VLOOKUP(A18,'Nom Prénom Equipe'!A:B,2,FALSE)","v":0},17]
["Equipe N°18",0,{"$f":"VLOOKUP(A19,'Nom Prénom Equipe'!A:B,2,FALSE)","v":0},18]
["Equipe N°19",0,{"$f":"VLOOKUP(A20,'Nom Prénom Equipe'!A:B,2,FALSE)","v":0},19]
["Equipe N°20",0,{"$f":"VLOOKUP(A21,'Nom Prénom Equipe'!A:B,2,FALSE)","v":0},20]
["Equipe N°21",0,{"$f":"VLOOKUP(A22,'Nom Prénom Equipe'!A:B,2,FALSE)","v":0},21]
["Equipe N°22",0,{"$f":"VLOOKUP(A23,'Nom Prénom Equipe'!A:B,2,FALSE)","v":0},22]
["Equipe N°23",0,{"$f":"VLOOKUP(A24,'Nom Prénom Equipe'!A:B,2,FALSE)","v":0},23]
["Equipe N°24",0,{"$f":"VLOOKUP(A25,'Nom Prénom Equipe'!A:B,2,FALSE)","v":0},24]
["Equipe N°25",0,{"$f":"VLOOKUP(A26,'Nom Prénom Equipe'!A:B,2,FALSE)","v":0},25]
["Equipe N°26",0,{"$f":"VLOOKUP(A27,'Nom Prénom Equipe'!A:B,2,FALSE)","v":0},26]
["Equipe N°27",0,{"$f":"VLOOKUP(A28,'Nom Prénom Equipe'!A:B,2,FALSE)","v":0},27]
["Equipe N°28",0,{"$f":"VLOOKUP(A29,'Nom Prénom Equipe'!A:B,2,FALSE)","v":0},28]
["Equipe N°29",0,{"$f":"VLOOKUP(A30,'Nom Prénom Equipe'!A:B,2,FALSE)","v":0},29]
{"$rows_left_out":72}
{"sheet":"Tirage 1,2 et 3 ème partie","index":7,"n_rows":46,"n_cols":9,"rows_kept":46,"cut":false,"hidden":false,"merged":[[0,1,0,2],[0,4,0,5],[0,7,0,8]]}
[null,"Première partie",null,null,"Deuxième partie",null,null,"Troisième partie"]
["Table n°1","Equipe n°1","Equipe n°2",null,"Equipe n°1","Equipe n°90",null,"Equipe n°1","Equipe n°88"]
["Table n°2","Equipe n°3","Equipe n°4",null,"Equipe n°3","Equipe n°2",null,"Equipe n°3","Equipe n°90"]
["Table n°3","Equipe n°5","Equipe n°6",null,"Equipe n°5","Equipe n°4",null,"Equipe n°5","Equipe n°2"]
["Table n°4","Equipe n°7","Equipe n°8",null,"Equipe n°7","Equipe n°6",null,"Equipe n°7","Equipe n°4"]
["Table n°5","Equipe n°9","Equipe n°10",null,"Equipe n°9","Equipe n°8",null,"Equipe n°9","Equipe n°6"]
["Table n°6","Equipe n°11","Equipe n°12",null,"Equipe n°11","Equipe n°10",null,"Equipe n°11","Equipe n°8"]
["Table n°7","Equipe n°13","Equipe n°14",null,"Equipe n°13","Equipe n°12",null,"Equipe n°13","Equipe n°10"]
["Table n°8","Equipe n°15","Equipe n°16",null,"Equipe n°15","Equipe n°14",null,"Equipe n°15","Equipe n°12"]
["Table n°9","Equipe n°17","Equipe n°18",null,"Equipe n°17","Equipe n°16",null,"Equipe n°17","Equipe n°14"]
["Table n°10","Equipe n°19","Equipe n°20",null,"Equipe n°19","Equipe n°18",null,"Equipe n°19","Equipe n°16"]
["Table n°11","Equipe n°21","Equipe n°22",null,"Equipe n°21","Equipe n°20",null,"Equipe n°21","Equipe n°18"]
["Table n°12","Equipe n°23","Equipe n°24",null,"Equipe n°23","Equipe n°22",null,"Equipe n°23","Equipe n°20"]
["Table n°13","Equipe n°25","Equipe n°26",null,"Equipe n°25","Equipe n°24",null,"Equipe n°25","Equipe n°22"]
["Table n°14","Equipe n°27","Equipe n°28",null,"Equipe n°27","Equipe n°26",null,"Equipe n°27","Equipe n°24"]
["Table n°15","Equipe n°29","Equipe n°30",null,"Equipe n°29","Equipe n°28",null,"Equipe n°29","Equipe n°26"]
["Table n°16","Equipe n°31","Equipe n°32",null,"Equipe n°31","Equipe n°30",null,"Equipe n°31","Equipe n°28"]
["Table n°17","Equipe n°33","Equipe n°34",null,"Equipe n°33","Equipe n°32",null,"Equipe n°33","Equipe n°30"]
["Table n°18","Equipe n°35","Equipe n°36",null,"Equipe n°35","Equipe n°34",null,"Equipe n°35","Equipe n°32"]
["Table n°19","Equipe n°37","Equipe n°38",null,"Equipe n°37","Equipe n°36",null,"Equipe n°37","Equipe n°34"]
["Table n°20","Equipe n°39","Equipe n°40",null,"Equipe n°39","Equipe n°38",null,"Equipe n°39","Equipe n°36"]
["Table n°21","Equipe n°41","Equipe n°42",null,"Equipe n°41","Equipe n°40",null,"Equipe n°41","Equipe n°38"]
["Table n°22","Equipe n°43","Equipe n°44",null,"Equipe n°43","Equipe n°42",null,"Equipe n°43","Equipe n°40"]
["Table n°23","Equipe n°45","Equipe n°46",null,"Equipe n°45","Equipe n°44",null,"Equipe n°45","Equipe n°42"]
["Table n°24","Equipe n°47","Equipe n°48",null,"Equipe n°47","Equipe n°46",null,"Equipe n°47","Equipe n°44"]
["Table n°25","Equipe n°49","Equipe n°50",null,"Equipe n°49","Equipe n°48",null,"Equipe n°49","Equipe n°46"]
["Table n°26","Equipe n°51","Equipe n°52",null,"Equipe n°51","Equipe n°50",null,"Equipe n°51","Equipe n°48"]
["Table n°27","Equipe n°53","Equipe n°54",null,"Equipe n°53","Equipe n°52",null,"Equipe n°53","Equipe n°50"]
["Table n°28","Equipe n°55","Equipe n°56",null,"Equipe n°55","Equipe n°54",null,"Equipe n°55","Equipe n°52"]
["Table n°29","Equipe n°57","Equipe n°58",null,"Equipe n°57","Equipe n°56",null,"Equipe n°57","Equipe n°54"]
{"$rows_left_out":16}