{"text_format":"1","workbook":"xlsx","n_sheets":8,"sheets":["Nom Prénom Equipe","Page principal","Classement après 1ère partie","Classement après 2ème partie","Classement après 3ème partie","Tirage des tables","Classement final","Tirage 1,2 et 3 ème partie"],"not_rendered":{"charts":0,"images":0,"macros":1,"external_links":0,"defined_names":0,"comments":0,"pivot_tables":0},"unopened":[],"bounds":{"document_bytes":16777216,"sheet_cells":100000,"rows_first":2000,"rows_last":500,"rows_between":2000,"halvings":0,"cell_chars":16384,"cell_head_chars":4096},"cells_cut":0,"cells_raw":0,"read":"whole","date_system":"1900"}

{"sheet":"Nom Prénom Equipe","index":0,"n_rows":91,"n_cols":4,"rows_kept":91,"cut":false,"hidden":false,"merged":[]}
["Numéro d'équipe","Noms participants","Nom prénom adresse 1er joueur","Nom prénom adresse 2ème joueur"]
["Equipe N°1"]
["Equipe N°2"]
["Equipe N°3"]
["Equipe N°4"]
["Equipe N°5"]
["Equipe N°6"]
["Equipe N°7"]
["Equipe N°8"]
["Equipe N°9"]
["Equipe N°10"]
["Equipe N°11"]
["Equipe N°12"]
["Equipe N°13"]
["Equipe N°14"]
["Equipe N°15"]
["Equipe N°16"]
["Equipe N°17"]
["Equipe N°18"]
["Equipe N°19"]
["Equipe N°20"]
["Equipe N°21"]
["Equipe N°22"]
["Equipe N°23"]
["Equipe N°24"]
["Equipe N°25"]
["Equipe N°26"]
["Equipe N°27"]
["Equipe N°28"]
["Equipe N°29"]
["Equipe N°30"]
["Equipe N°31"]
["Equipe N°32"]
["Equipe N°33"]
["Equipe N°34"]
["Equipe N°35"]
["Equipe N°36"]
["Equipe N°37"]
["Equipe N°38"]
["Equipe N°39"]
["Equipe N°40"]
["Equipe N°41"]
["Equipe N°42"]
["Equipe N°43"]
["Equipe N°44"]
["Equipe N°45"]
["Equipe N°46"]
["Equipe N°47"]
["Equipe N°48"]
["Equipe N°49"]
["Equipe N°50"]
["Equipe N°51"]
["Equipe N°52"," "]
["Equipe N°53"," "]
["Equipe N°54"," "]
["Equipe N°55"," "]
["Equipe N°56"," "]
["Equipe N°57"," "]
["Equipe N°58"," "]
["Equipe N°59"," "]
["Equipe N°60"," "]
["Equipe N°61"," "]
["Equipe N°62"," "]
["Equipe N°63"," "]
["Equipe N°64"," "]
["Equipe N°65"," "]
["Equipe N°66"," "]
["Equipe N°67"," "]
["Equipe N°68"," "]
["Equipe N°69"," "]
["Equipe N°70"," "]
["Equipe N°71"," "]
["Equipe N°72"," "]
["Equipe N°73"," "]
["Equipe N°74"," "]
["Equipe N°75"," "]
["Equipe N°76"," "]
["Equipe N°77"," "]
["Equipe N°78"," "]
["Equipe N°79"," "]
["Equipe N°80"," "]
["Equipe N°81"," "]
["Equipe N°82"," "]
["Equipe N°83"," "]
["Equipe N°84"," "]
["Equipe N°85"," "]
["Equipe N°86"," "]
["Equipe N°87"," "]
["Equipe N°88"," "]
["Equipe N°89"," "]
["Equipe N°90"," "]

{"sheet":"Page principal","index":1,"n_rows":101,"n_cols":14,"rows_kept":101,"cut":false,"hidden":false,"merged":[[90,12,91,12],[3,11,4,11],[84,12,85,12],[86,12,87,12],[88,12,89,12],[76,12,77,12],[78,12,79,12],[80,12,81,12],[82,12,83,12],[68,12,69,12],[70,12,71,12],[72,12,73,12],[74,12,75,12],[60,12,61,12],[62,12,63,12],[64,12,65,12],[66,12,67,12],[52,12,53,12],[54,12,55,12],[56,12,57,12],[58,12,59,12],[44,12,45,12],[46,12,47,12],[48,12,49,12],[50,12,51,12],[36,12,37,12],[38,12,39,12],[40,12,41,12],[42,12,43,12],[28,12,29,12],[30,12,31,12],[32,12,33,12],[34,12,35,12],[20,12,21,12],[22,12,23,12],[24,12,25,12],[26,12,27,12],[89,11,90,11],[2,12,3,12],[4,12,5,12],[6,12,7,12],[8,12,9,12],[10,12,11,12],[12,12,13,12],[14,12,15,12],[16,12,17,12],[18,12,19,12],[81,11,82,11],[83,11,84,11],[65,11,66,11],[67,11,68,11],[69,11,70,11],[71,11,72,11],[87,11,88,11],[73,11,74,11],[75,11,76,11],[77,11,78,11],[79,11,80,11],[57,11,58,11],[59,11,60,11],[61,11,62,11],[63,11,64,11],[85,11,86,11],[49,11,50,11],[51,11,52,11],[53,11,54,11],[55,11,56,11],[41,11,42,11],[43,11,44,11],[45,11,46,11],[47,11,48,11],[33,11,34,11],[35,11,36,11],[37,11,38,11],[39,11,40,11],[7,11,8,11],[25,11,26,11],[27,11,28,11],[29,11,30,11],[31,11,32,11],[17,11,18,11],[19,11,20,11],[21,11,22,11],[23,11,24,11],[18,8,20,10],[12,8,14,10],[6,8,8,10],[0,8,2,10],[9,11,10,11],[11,11,12,11],[13,11,14,11],[15,11,16,11],[1,11,2,11],[5,11,6,11]]}
["Numéro d'équipe","1ère partie","2ème partie ","Total intermediaire","3ème partie","Totale des 3 parties","4ème partie","Totale des 4 parties","classement après 1ère",null,null,"Somme partie 1","Somme partie 2","Somme partie 3"]
["Equipe N°1",null,null,{"$f":"SUM(B2:C2)","v":0},null,{"$f":"SUM(D2:E2)","v":0},null,{"$f":"SUM(F2:G2)","v":0},null,null,null,{"$f":"IF(B2+B3=2512,\"ok\",\"erreur\")","v":"erreur"},{"$f":"IF(C2+C49=2512,\"ok\",\"erreur\")","v":"erreur"},{"$f":"IF(E2+E7=2512,\"ok\",\"erreur\")","v":"erreur"}]
["Equipe N°2",null,null,0,null,0,null,0,null,null,null,null,{"$f":"IF(C3+C4=2512,\"ok\",\"erreur\")","v":"erreur"}," "]
["Equipe N°3",null,null,0,null,0,null,0,null,null,null,{"$f":"IF(B4+B5=2512,\"ok\",\"erreur\")","v":"erreur"},null,{"$f":"IF(E4+E49=2512,\"ok\",\"erreur\")","v":"erreur"}]
["Equipe N°4",null,null,0,null,0,null,0,null,null,null,null,{"$f":"IF(C5+C6=2512,\"ok\",\"erreur\")","v":"erreur"}]
["Equipe N°5",null,null,0,null,0,null,0,null,null,null,{"$f":"IF(B6+B7=2512,\"ok\",\"erreur\")","v":"erreur"},null,{"$f":"IF(E6+E3=2512,\"ok\",\"erreur\")","v":"erreur"}]
["Equipe N°6",null,null,0,null,0,null,0,"classement après 2ème",null,null,null,{"$f":"IF(C7+C8=2512,\"ok\",\"erreur\")","v":"erreur"}]
["Equipe N°7",null,null,0,null,0,null,0,null,null,null,{"$f":"IF(B8+B9=2512,\"ok\",\"erreur\")","v":"erreur"},null,{"$f":"IF(E8+E5=2512,\"ok\",\"erreur\")","v":"erreur"}]
["Equipe N°8",null,null,0,null,0,null,0,null,null,null,null,{"$f":"IF(C9+C10=2512,\"ok\",\"erreur\")","v":"erreur"}]
["Equipe N°9",null,null,0,null,0,null,0,null,null,null,{"$f":"IF(B10+B11=2512,\"ok\",\"erreur\")","v":"erreur"},null,{"$f":"IF(E10+E7=2512,\"ok\",\"erreur\")","v":"erreur"}]
["Equipe N°10",null,null,0,null,0,null,0,null,null,null,null,{"$f":"IF(C11+C12=2512,\"ok\",\"erreur\")","v":"erreur"}]
["Equipe N°11",null,null,0,null,0,null,0,null,null,null,{"$f":"IF(B12+B13=2512,\"ok\",\"erreur\")","v":"erreur"},null,{"$f":"IF(E12+E9=2512,\"ok\",\"erreur\")","v":"erreur"}]
["Equipe N°12",null,null,0,null,0,null,0,"classement après 3ème",null,null,null,{"$f":"IF(C13+C14=2512,\"ok\",\"erreur\")","v":"erreur"}]
["Equipe N°13",null,null,0,null,0,null,0,null,null,null,{"$f":"IF(B14+B15=2512,\"ok\",\"erreur\")","v":"erreur"},null,{"$f":"IF(E14+E11=2512,\"ok\",\"erreur\")","v":"erreur"}]
["Equipe N°14",null,null,0,null,0,null,0,null,null,null,null,{"$f":"IF(C15+C16=2512,\"ok\",\"erreur\")","v":"erreur"}]
["Equipe N°15",null,null,0,null,0,null,0,null,null,null,{"$f":"IF(B16+B17=2512,\"ok\",\"erreur\")","v":"erreur"},null,{"$f":"IF(E16+E13=2512,\"ok\",\"erreur\")","v":"erreur"}]
["Equipe N°16",null,null,0,null,0,null,0,null,null,null,null,{"$f":"IF(C17+C18=2512,\"ok\",\"erreur\")","v":"erreur"}]
["Equipe N°17",null,null,0,null,0,null,0,null,null,null,{"$f":"IF(B18+B19=2512,\"ok\",\"erreur\")","v":"erreur"},null,{"$f":"IF(E18+E15=2512,\"ok\",\"erreur\")","v":"erreur"}]
["Equipe N°18",null,null,0,null,0,null,0,"classement final",null,null,null,{"$f":"IF(C19+C20=2512,\"ok\",\"erreur\")","v":"erreur"}]
["Equipe N°19",null,null,0,null,0,null,0,null,null,null,{"$f":"IF(B20+B21=2512,\"ok\",\"erreur\")","v":"erreur"},null,{"$f":"IF(E20+E17=2512,\"ok\",\"erreur\")","v":"erreur"}]
["Equipe N°20",null,null,0,null,0,null,0,null,null,null,null,{"$f":"IF(C21+C22=2512,\"ok\",\"erreur\")","v":"erreur"}]
["Equipe N°21",null,null,0,null,0,null,0,null,null,null,{"$f":"IF(B22+B23=2512,\"ok\",\"erreur\")","v":"erreur"},null,{"$f":"IF(E22+E19=2512,\"ok\",\"erreur\")","v":"erreur"}]
["Equipe N°22",null,null,0,null,0,null,0,null,null,null,null,{"$f":"IF(C23+C24=2512,\"ok\",\"erreur\")","v":"erreur"}]
["Equipe N°23",null,null,0,null,0,null,0,null,null,null,{"$f":"IF(B24+B25=2512,\"ok\",\"erreur\")","v":"erreur"},null,{"$f":"IF(E24+E21=2512,\"ok\",\"erreur\")","v":"erreur"}]
["Equipe N°24",null,null,0,null,0,null,0,null,null,null,null,{"$f":"IF(C25+C26=2512,\"ok\",\"erreur\")","v":"erreur"}]
["Equipe N°25",null,null,0,null,0,null,0,null,null,null,{"$f":"IF(B26+B27=2512,\"ok\",\"erreur\")","v":"erreur"},null,{"$f":"IF(E26+E23=2512,\"ok\",\"erreur\")","v":"erreur"}]
["Equipe N°26",null,null,0,null,0,null,0,null,null,null,null,{"$f":"IF(C27+C28=2512,\"ok\",\"erreur\")","v":"erreur"}]
["Equipe N°27",null,null,0,null,0,null,0,null,null,null,{"$f":"IF(B28+B29=2512,\"ok\",\"erreur\")","v":"erreur"},null,{"$f":"IF(E28+E25=2512,\"ok\",\"erreur\")","v":"erreur"}]
["Equipe N°28",null,null,0,null,0,null,0,null,null,null,null,{"$f":"IF(C29+C30=2512,\"ok\",\"erreur\")","v":"erreur"}]
["Equipe N°29",null,null,0,null,0,null,0,null,null,null,{"$f":"IF(B30+B31=2512,\"ok\",\"erreur\")","v":"erreur"},null,{"$f":"IF(E30+E27=2512,\"ok\",\"erreur\")","v":"erreur"}]
["Equipe N°30",null,null,0,null,0,null,0,null,null,null,null,{"$f":"IF(C31+C32=2512,\"ok\",\"erreur\")","v":"erreur"}]
["Equipe N°31",null,null,0,null,0,null,0,null,null,null,{"$f":"IF(B32+B33=2512,\"ok\",\"erreur\")","v":"erreur"},null,{"$f":"IF(E32+E29=2512,\"ok\",\"erreur\")","v":"erreur"}]
["Equipe N°32",null,null,0,null,0,null,0,null,null,null,null,{"$f":"IF(C33+C34=2512,\"ok\",\"erreur\")","v":"erreur"}]
["Equipe N°33",null,null,{"$f":"SUM(B34:C34)","v":0},null,{"$f":"SUM(D34:E34)","v":0},null,{"$f":"SUM(F34:G34)","v":0},null,null,null,{"$f":"IF(B34+B35=2512,\"ok\",\"erreur\")","v":"erreur"},null,{"$f":"IF(E34+E31=2512,\"ok\",\"erreur\")","v":"erreur"}]
["Equipe N°34",null,null,0,null,0,null,0,null,null,null,null,{"$f":"IF(C35+C36=2512,\"ok\",\"erreur\")","v":"erreur"}]
["Equipe N°35",null,null,0,null,0,null,0,null,null,null,{"$f":"IF(B36+B37=2512,\"ok\",\"erreur\")","v":"erreur"},null,{"$f":"IF(E36+E33=2512,\"ok\",\"erreur\")","v":"erreur"}]
["Equipe N°36",null,null,0,null,0,null,0,null,null,null,null,{"$f":"IF(C37+C38=2512,\"ok\",\"erreur\")","v":"erreur"}]
["Equipe N°37",null,null,0,null,0,null,0,null,null,null,{"$f":"IF(B38+B39=2512,\"ok\",\"erreur\")","v":"erreur"},null,{"$f":"IF(E38+E35=2512,\"ok\",\"erreur\")","v":"erreur"}]
["Equipe N°38",null,null,0,null,0,null,0,null,null,null,null,{"$f":"IF(C39+C40=2512,\"ok\",\"erreur\")","v":"erreur"}]
["Equipe N°39",null,null,0,null,0,null,0,null,null,null,{"$f":"IF(B40+B41=2512,\"ok\",\"erreur\")","v":"erreur"},null,{"$f":"IF(E40+E37=2512,\"ok\",\"erreur\")","v":"erreur"}]
["Equipe N°40",null,null,0,null,0,null,0,null,null,null,null,{"$f":"IF(C41+C42=2512,\"ok\",\"erreur\")","v":"erreur"}]
["Equipe N°41",null,null,0,null,0,null,0,null,null,null,{"$f":"IF(B42+B43=2512,\"ok\",\"erreur\")","v":"erreur"},null,{"$f":"IF(E42+E39=2512,\"ok\",\"erreur\")","v":"erreur"}]
["Equipe N°42",null,null,0,null,0,null,0,null,null,null,null,{"$f":"IF(C43+C44=2512,\"ok\",\"erreur\")","v":"erreur"}]
["Equipe N°43",null,null,0,null,0,null,0,null,null,null,{"$f":"IF(B44+B45=2512,\"ok\",\"erreur\")","v":"erreur"},null,{"$f":"IF(E44+E41=2512,\"ok\",\"erreur\")","v":"erreur"}]
["Equipe N°44",null,null,0,null,0,null,0,null,null,null,null,{"$f":"IF(C45+C46=2512,\"ok\",\"erreur\")","v":"erreur"}]
["Equipe N°45",null,null,0,null,0,null,0,null,null,null,{"$f":"IF(B46+B47=2512,\"ok\",\"erreur\")","v":"erreur"},null,{"$f":"IF(E46+E43=2512,\"ok\",\"erreur\")","v":"erreur"}]
["Equipe N°46",null,null,0,null,0,null,0,null,null,null,null,{"$f":"IF(C47+C48=2512,\"ok\",\"erreur\")","v":"erreur"}]
["Equipe N°47",null,null,0,null,0,null,0,null,null,null,{"$f":"IF(B48+B49=2512,\"ok\",\"erreur\")","v":"erreur"},null,{"$f":"IF(E48+E45=2512,\"ok\",\"erreur\")","v":"erreur"}]
["Equipe N°48",null,null,0,null,0,null,0,null,null,null,null,{"$f":"IF(C49+C50=2512,\"ok\",\"erreur\")","v":"erreur"}]
["Equipe N°49",null,null,0,null,0,null,0,null,null,null,{"$f":"IF(B50+B51=2512,\"ok\",\"erreur\")","v":"erreur"},null,{"$f":"IF(E50+E47=2512,\"ok\",\"erreur\")","v":"erreur"}]
["Equipe N°50",null,null,0,null,0,null,0,null,null,null,null,{"$f":"IF(C51+C52=2512,\"ok\",\"erreur\")","v":"erreur"}]
["Equipe N°51",null,null,0,null,0,null,0,null,null,null,{"$f":"IF(B52+B53=2512,\"ok\",\"erreur\")","v":"erreur"},null,{"$f":"IF(E52+E49=2512,\"ok\",\"erreur\")","v":"erreur"}]
["Equipe N°52",null,null,0,null,0,null,0,null,null,null,null,{"$f":"IF(C53+C54=2512,\"ok\",\"erreur\")","v":"erreur"}]
["Equipe N°53",null,null,0,null,0,null,0,null,null,null,{"$f":"IF(B54+B55=2512,\"ok\",\"erreur\")","v":"erreur"},null,{"$f":"IF(E54+E51=2512,\"ok\",\"erreur\")","v":"erreur"}]
["Equipe N°54",null,null,0,null,0,null,0,null,null,null,null,{"$f":"IF(C55+C56=2512,\"ok\",\"erreur\")","v":"erreur"}]
["Equipe N°55",null,null,0,null,0,null,0,null,null,null,{"$f":"IF(B56+B57=2512,\"ok\",\"erreur\")","v":"erreur"},null,{"$f":"IF(E56+E53=2512,\"ok\",\"erreur\")","v":"erreur"}]
["Equipe N°56",null,null,0,null,0,null,0,null,null,null,null,{"$f":"IF(C57+C58=2512,\"ok\",\"erreur\")","v":"erreur"}]
["Equipe N°57",null,null,0,null,0,null,0,null,null,null,{"$f":"IF(B58+B59=2512,\"ok\",\"erreur\")","v":"erreur"},null,{"$f":"IF(E58+E55=2512,\"ok\",\"erreur\")","v":"erreur"}]
["Equipe N°58",null,null,0,null,0,null,0,null,null,null,null,{"$f":"IF(C59+C2=2512,\"ok\",\"erreur\")","v":"erreur"}]
["Equipe N°59",null,null,0,null,0,null,0,null,null,null,{"$f":"IF(B60+B61=2512,\"ok\",\"erreur\")","v":"erreur"},null,{"$f":"IF(E59+E4=2512,\"ok\",\"erreur\")","v":"erreur"}]
["Equipe N°60",null,null,0,null,0,null,0,null,null,null,null,{"$f":"IF(C61+C62=2512,\"ok\",\"erreur\")","v":"erreur"}]
["Equipe N°61",null,null,0,null,0,null,0,null,null,null,{"$f":"IF(B62+B63=2512,\"ok\",\"erreur\")","v":"erreur"},null,{"$f":"IF(E62+E59=2512,\"ok\",\"erreur\")","v":"erreur"}]
["Equipe N°62",null,null,0,null,0,null,0,null,null,null,null,{"$f":"IF(C63+C64=2512,\"ok\",\"erreur\")","v":"erreur"}]
["Equipe N°63",null,null,0,null,0,null,0,null,null,null,{"$f":"IF(B64+B65=2512,\"ok\",\"erreur\")","v":"erreur"},null,{"$f":"IF(E64+E61=2512,\"ok\",\"erreur\")","v":"erreur"}]
["Equipe N°64",null,null,0,null,0,null,0,null,null,null,null,{"$f":"IF(C65+C66=2512,\"ok\",\"erreur\")","v":"erreur"}]
["Equipe N°65",null,null,{"$f":"SUM(B66:C66)","v":0},null,{"$f":"SUM(D66:E66)","v":0},null,{"$f":"SUM(F66:G66)","v":0},null,null,null,{"$f":"IF(B66+B67=2512,\"ok\",\"erreur\")","v":"erreur"},null,{"$f":"IF(E66+E63=2512,\"ok\",\"erreur\")","v":"erreur"}]
["Equipe N°66",null,null,0,null,0,null,0,null,null,null,null,{"$f":"IF(C67+C68=2512,\"ok\",\"erreur\")","v":"erreur"}]
["Equipe N°67",null,null,0,null,0,null,0,null,null,null,{"$f":"IF(B68+B69=2512,\"ok\",\"erreur\")","v":"erreur"},null,{"$f":"IF(E68+E65=2512,\"ok\",\"erreur\")","v":"erreur"}]
["Equipe N°68",null,null,0,null,0,null,0,null,null,null,null,{"$f":"IF(C69+C70=2512,\"ok\",\"erreur\")","v":"erreur"}]
["Equipe N°69",null,null,0,null,0,null,0,null,null,null,{"$f":"IF(B70+B71=2512,\"ok\",\"erreur\")","v":"erreur"},null,{"$f":"IF(E70+E67=2512,\"ok\",\"erreur\")","v":"erreur"}]
["Equipe N°70",null,null,0,null,0,null,0,null,null,null,null,{"$f":"IF(C71+C72=2512,\"ok\",\"erreur\")","v":"erreur"}]
["Equipe N°71",null,null,0,null,0,null,0,null,null,null,{"$f":"IF(B72+B73=2512,\"ok\",\"erreur\")","v":"erreur"},null,{"$f":"IF(E72+E69=2512,\"ok\",\"erreur\")","v":"erreur"}]
["Equipe N°72",null,null,0,null,0,null,0,null,null,null,null,{"$f":"IF(C73+C74=2512,\"ok\",\"erreur\")","v":"erreur"}]
["Equipe N°73",null,null,0,null,0,null,0,null,null,null,{"$f":"IF(B74+B75=2512,\"ok\",\"erreur\")","v":"erreur"},null,{"$f":"IF(E74+E71=2512,\"ok\",\"erreur\")","v":"erreur"}]
["Equipe N°74",null,null,0,null,0,null,0,null,null,null,null,{"$f":"IF(C75+C76=2512,\"ok\",\"erreur\")","v":"erreur"}]
["Equipe N°75",null,null,0,null,0,null,0,null,null,null,{"$f":"IF(B76+B77=2512,\"ok\",\"erreur\")","v":"erreur"},null,{"$f":"IF(E76+E73=2512,\"ok\",\"erreur\")","v":"erreur"}]
["Equipe N°76",null,null,0,null,0,null,0,null,null,null,null,{"$f":"IF(C77+C78=2512,\"ok\",\"erreur\")","v":"erreur"}]
["Equipe N°77",null,null,0,null,0,null,0,null,null,null,{"$f":"IF(B78+B79=2512,\"ok\",\"erreur\")","v":"erreur"},null,{"$f":"IF(E78+E75=2512,\"ok\",\"erreur\")","v":"erreur"}]
["Equipe N°78",null,null,0,null,0,null,0,null,null,null,null,{"$f":"IF(C79+C80=2512,\"ok\",\"erreur\")","v":"erreur"}]
["Equipe N°79",null,null,0,null,0,null,0,null,null,null,{"$f":"IF(B80+B81=2512,\"ok\",\"erreur\")","v":"erreur"},null,{"$f":"IF(E80+E77=2512,\"ok\",\"erreur\")","v":"erreur"}]
["Equipe N°80",null,null,0,null,0,null,0,null,null,null,null,{"$f":"IF(C81+C82=2512,\"ok\",\"erreur\")","v":"erreur"}]
["Equipe N°81",null,null,0,null,0,null,0,null,null,null,{"$f":"IF(B82+B83=2512,\"ok\",\"erreur\")","v":"erreur"},null,{"$f":"IF(E82+E79=2512,\"ok\",\"erreur\")","v":"erreur"}]
["Equipe N°82",null,null,0,null,0,null,0,null,null,null,null,{"$f":"IF(C83+C84=2512,\"ok\",\"erreur\")","v":"erreur"}]
["Equipe N°83",null,null,0,null,0,null,0,null,null,null,{"$f":"IF(B84+B85=2512,\"ok\",\"erreur\")","v":"erreur"},null,{"$f":"IF(E84+E81=2512,\"ok\",\"erreur\")","v":"erreur"}]
["Equipe N°84",null,null,0,null,0,null,0,null,null,null,null,{"$f":"IF(C85+C86=2512,\"ok\",\"erreur\")","v":"erreur"}]
["Equipe N°85",null,null,0,null,0,null,0,null,null,null,{"$f":"IF(B86+B87=2512,\"ok\",\"erreur\")","v":"erreur"},null,{"$f":"IF(E86+E83=2512,\"ok\",\"erreur\")","v":"erreur"}]
["Equipe N°86",null,null,0,null,0,null,0,null,null,null,null,{"$f":"IF(C87+C88=2512,\"ok\",\"erreur\")","v":"erreur"}]
["Equipe N°87",null,null,0,null,0,null,0,null,null,null,{"$f":"IF(B88+B89=2512,\"ok\",\"erreur\")","v":"erreur"},null,{"$f":"IF(E88+E85=2512,\"ok\",\"erreur\")","v":"erreur"}]
["Equipe N°88",null,null,0,null,0,null,0,null,null,null,null,{"$f":"IF(C89+C90=2512,\"ok\",\"erreur\")","v":"erreur"}]
["Equipe N°89",null,null,0,null,0,null,0,null,null,null,{"$f":"IF(B90+B91=2512,\"ok\",\"erreur\")","v":"erreur"},null,{"$f":"IF(E90+E87=2512,\"ok\",\"erreur\")","v":"erreur"}]
["Equipe N°90",null,null,0,null,0,null,0,null,null,null,null," "]
[null,null,null,0,null,0,null,0]
[null,null,null,0,null,0,null,0]
[null,null,null,0,null,0,null,0]
[null,null,null,0,null,0,null,0]
[null,null,null,0,null,0,null,0]
[null,null,null,0,null,0,null,0]
[null,null,null,{"$f":"SUM(B98:C98)","v":0},null,{"$f":"SUM(D98:E98)","v":0},null,{"$f":"SUM(F98:G98)","v":0}]
[null,null,null,{"$f":"SUM(B99:C99)","v":0},null,{"$f":"SUM(D99:E99)","v":0},null,{"$f":"SUM(F99:G99)","v":0}]
[null,null,null,{"$f":"SUM(B100:C100)","v":0},null,{"$f":"SUM(D100:E100)","v":0},null,{"$f":"SUM(F100:G100)","v":0}]
[null,null,null,{"$f":"SUM(B101:C101)","v":0},null,{"$f":"SUM(D101:E101)","v":0},null,{"$f":"SUM(F101:G101)","v":0}]

{"sheet":"Classement après 1ère partie","index":2,"n_rows":101,"n_cols":4,"rows_kept":101,"cut":false,"hidden":false,"merged":[]}
["Numéro d'équipe","Points","Noms équipe","Rang"]
["Equipe N°1",0,{"$f":"VLOOKUP(A2,'Nom Prénom Equipe'!A:B,2,FALSE)","v":0},1]
["Equipe N°2",0,{"$f":"VLOOKUP(A3,'Nom Prénom Equipe'!A:B,2,FALSE)","v":0},2]
["Equipe N°3",0,{"$f":"VLOOKUP(A4,'Nom Prénom Equipe'!A:B,2,FALSE)","v":0},3]
["Equipe N°4",0,{"$f":"VLOOKUP(A5,'Nom Prénom Equipe'!A:B,2,FALSE)","v":0},4]
["Equipe N°5",0,{"$f":"VLOOKUP(A6,'Nom Prénom Equipe'!A:B,2,FALSE)","v":0},5]
["Equipe N°6",0,{"$f":"VLOOKUP(A7,'Nom Prénom Equipe'!A:B,2,FALSE)","v":0},6]
["Equipe N°7",0,{"$f":"VLOOKUP(A8,'Nom Prénom Equipe'!A:B,2,FALSE)","v":0},7]
["Equipe N°8",0,{"$f":"VLOOKUP(A9,'Nom Prénom Equipe'!A:B,2,FALSE)","v":0},8]
["Equipe N°9",0,{"$f":"VLOOKUP(A10,'Nom Prénom Equipe'!A:B,2,FALSE)","v":0},9]
["Equipe N°10",0,{"$f":"VLOOKUP(A11,'Nom Prénom Equipe'!A:B,2,FALSE)","v":0},10]
["Equipe N°11",0,{"$f":"VLOOKUP(A12,'Nom Prénom Equipe'!A:B,2,FALSE)","v":0},11]
["Equipe N°12",0,{"$f":"VLOOKUP(A13,'Nom Prénom Equipe'!A:B,2,FALSE)","v":0},12]
["Equipe N°13",0,{"$f":"VLOOKUP(A14,'Nom Prénom Equipe'!A:B,2,FALSE)","v":0},13]
["Equipe N°14",0,{"$f":"VLOOKUP(A15,'Nom Prénom Equipe'!A:B,2,FALSE)","v":0},14]
["Equipe N°15",0,{"$f":"VLOOKUP(A16,'Nom Prénom Equipe'!A:B,2,FALSE)","v":0},15]
["Equipe N°16",0,{"$f":"VLOOKUP(A17,'Nom Prénom Equipe'!A:B,2,FALSE)","v":0},16]
["Equipe N°17",0,{"$f":"VLOOKUP(A18,'Nom Prénom Equipe'!A:B,2,FALSE)","v":0},17]
["Equipe N°18",0,{"$f":"VLOOKUP(A19,'Nom Prénom Equipe'!A:B,2,FALSE)","v":0},18]
["Equipe N°19",0,{"$f":"VLOOKUP(A20,'Nom Prénom Equipe'!A:B,2,FALSE)","v":0},19]
["Equipe N°20",0,{"$f":"VLOOKUP(A21,'Nom Prénom Equipe'!A:B,2,FALSE)","v":0},20]
["Equipe N°21",0,{"$f":"VLOOKUP(A22,'Nom Prénom Equipe'!A:B,2,FALSE)","v":0},21]
["Equipe N°22",0,{"$f":"VLOOKUP(A23,'Nom Prénom Equipe'!A:B,2,FALSE)","v":0},22]
["Equipe N°23",0,{"$f":"VLOOKUP(A24,'Nom Prénom Equipe'!A:B,2,FALSE)","v":0},23]
["Equipe N°24",0,{"$f":"VLOOKUP(A25,'Nom Prénom Equipe'!A:B,2,FALSE)","v":0},24]
["Equipe N°25",0,{"$f":"VLOOKUP(A26,'Nom Prénom Equipe'!A:B,2,FALSE)","v":0},25]
["Equipe N°26",0,{"$f":"VLOOKUP(A27,'Nom Prénom Equipe'!A:B,2,FALSE)","v":0},26]
["Equipe N°27",0,{"$f":"VLOOKUP(A28,'Nom Prénom Equipe'!A:B,2,FALSE)","v":0},27]
["Equipe N°28",0,{"$f":"VLOOKUP(A29,'Nom Prénom Equipe'!A:B,2,FALSE)","v":0},28]
["Equipe N°29",0,{"$f":"VLOOKUP(A30,'Nom Prénom Equipe'!A:B,2,FALSE)","v":0},29]
["Equipe N°30",0,{"$f":"VLOOKUP(A31,'Nom Prénom Equipe'!A:B,2,FALSE)","v":0},30]
["Equipe N°31",0,{"$f":"VLOOKUP(A32,'Nom Prénom Equipe'!A:B,2,FALSE)","v":0},31]
["Equipe N°32",0,{"$f":"VLOOKUP(A33,'Nom Prénom Equipe'!A:B,2,FALSE)","v":0},32]
["Equipe N°33",0,{"$f":"VLOOKUP(A34,'Nom Prénom Equipe'!A:B,2,FALSE)","v":0},33]
["Equipe N°34",0,{"$f":"VLOOKUP(A35,'Nom Prénom Equipe'!A:B,2,FALSE)","v":0},34]
["Equipe N°35",0,{"$f":"VLOOKUP(A36,'Nom Prénom Equipe'!A:B,2,FALSE)","v":0},35]
["Equipe N°36",0,{"$f":"VLOOKUP(A37,'Nom Prénom Equipe'!A:B,2,FALSE)","v":0},36]
["Equipe N°37",0,{"$f":"VLOOKUP(A38,'Nom Prénom Equipe'!A:B,2,FALSE)","v":0},37]
["Equipe N°38",0,{"$f":"VLOOKUP(A39,'Nom Prénom Equipe'!A:B,2,FALSE)","v":0},38]
["Equipe N°39",0,{"$f":"VLOOKUP(A40,'Nom Prénom Equipe'!A:B,2,FALSE)","v":0},39]
["Equipe N°40",0,{"$f":"VLOOKUP(A41,'Nom Prénom Equipe'!A:B,2,FALSE)","v":0},40]
["Equipe N°41",0,{"$f":"VLOOKUP(A42,'Nom Prénom Equipe'!A:B,2,FALSE)","v":0},41]
["Equipe N°42",0,{"$f":"VLOOKUP(A43,'Nom Prénom Equipe'!A:B,2,FALSE)","v":0},42]
["Equipe N°43",0,{"$f":"VLOOKUP(A44,'Nom Prénom Equipe'!A:B,2,FALSE)","v":0},43]
["Equipe N°44",0,{"$f":"VLOOKUP(A45,'Nom Prénom Equipe'!A:B,2,FALSE)","v":0},44]
["Equipe N°45",0,{"$f":"VLOOKUP(A46,'Nom Prénom Equipe'!A:B,2,FALSE)","v":0},45]
["Equipe N°46",0,{"$f":"VLOOKUP(A47,'Nom Prénom Equipe'!A:B,2,FALSE)","v":0},46]
["Equipe N°47",0,{"$f":"VLOOKUP(A48,'Nom Prénom Equipe'!A:B,2,FALSE)","v":0},47]
["Equipe N°48",0,{"$f":"VLOOKUP(A49,'Nom Prénom Equipe'!A:B,2,FALSE)","v":0},48]
["Equipe N°49",0,{"$f":"VLOOKUP(A50,'Nom Prénom Equipe'!A:B,2,FALSE)","v":0},49]
["Equipe N°50",0,{"$f":"VLOOKUP(A51,'Nom Prénom Equipe'!A:B,2,FALSE)","v":0},50]
["Equipe N°51",0,{"$f":"VLOOKUP(A52,'Nom Prénom Equipe'!A:B,2,FALSE)","v":0},51]
["Equipe N°52",0,{"$f":"VLOOKUP(A53,'Nom Prénom Equipe'!A:B,2,FALSE)","v":" "},52]
["Equipe N°53",0,{"$f":"VLOOKUP(A54,'Nom Prénom Equipe'!A:B,2,FALSE)","v":" "},53]
["Equipe N°54",0,{"$f":"VLOOKUP(A55,'Nom Prénom Equipe'!A:B,2,FALSE)","v":" "},54]
["Equipe N°55",0,{"$f":"VLOOKUP(A56,'Nom Prénom Equipe'!A:B,2,FALSE)","v":" "},55]
["Equipe N°56",0,{"$f":"VLOOKUP(A57,'Nom Prénom Equipe'!A:B,2,FALSE)","v":" "},56]
["Equipe N°57",0,{"$f":"VLOOKUP(A58,'Nom Prénom Equipe'!A:B,2,FALSE)","v":" "},57]
["Equipe N°58",0,{"$f":"VLOOKUP(A59,'Nom Prénom Equipe'!A:B,2,FALSE)","v":" "},58]
["Equipe N°59",0,{"$f":"VLOOKUP(A60,'Nom Prénom Equipe'!A:B,2,FALSE)","v":" "},59]
["Equipe N°60",0,{"$f":"VLOOKUP(A61,'Nom Prénom Equipe'!A:B,2,FALSE)","v":" "},60]
["Equipe N°61",0,{"$f":"VLOOKUP(A62,'Nom Prénom Equipe'!A:B,2,FALSE)","v":" "},61]
["Equipe N°62",0,{"$f":"VLOOKUP(A63,'Nom Prénom Equipe'!A:B,2,FALSE)","v":" "},62]
["Equipe N°63",0,{"$f":"VLOOKUP(A64,'Nom Prénom Equipe'!A:B,2,FALSE)","v":" "},63]
["Equipe N°64",0,{"$f":"VLOOKUP(A65,'Nom Prénom Equipe'!A:B,2,FALSE)","v":" "},64]
["Equipe N°65",0,{"$f":"VLOOKUP(A66,'Nom Prénom Equipe'!A:B,2,FALSE)","v":" "},65]
["Equipe N°66",0,{"$f":"VLOOKUP(A67,'Nom Prénom Equipe'!A:B,2,FALSE)","v":" "},66]
["Equipe N°67",0,{"$f":"VLOOKUP(A68,'Nom Prénom Equipe'!A:B,2,FALSE)","v":" "},67]
["Equipe N°68",0,{"$f":"VLOOKUP(A69,'Nom Prénom Equipe'!A:B,2,FALSE)","v":" "},68]
["Equipe N°69",0,{"$f":"VLOOKUP(A70,'Nom Prénom Equipe'!A:B,2,FALSE)","v":" "},69]
["Equipe N°70",0,{"$f":"VLOOKUP(A71,'Nom Prénom Equipe'!A:B,2,FALSE)","v":" "},70]
["Equipe N°71",0,{"$f":"VLOOKUP(A72,'Nom Prénom Equipe'!A:B,2,FALSE)","v":" "},71]
["Equipe N°72",0,{"$f":"VLOOKUP(A73,'Nom Prénom Equipe'!A:B,2,FALSE)","v":" "},72]
["Equipe N°73",0,{"$f":"VLOOKUP(A74,'Nom Prénom Equipe'!A:B,2,FALSE)","v":" "},73]
["Equipe N°74",0,{"$f":"VLOOKUP(A75,'Nom Prénom Equipe'!A:B,2,FALSE)","v":" "},74]
["Equipe N°75",0,{"$f":"VLOOKUP(A76,'Nom Prénom Equipe'!A:B,2,FALSE)","v":" "},75]
["Equipe N°76",0,{"$f":"VLOOKUP(A77,'Nom Prénom Equipe'!A:B,2,FALSE)","v":" "},76]
["Equipe N°77",0,{"$f":"VLOOKUP(A78,'Nom Prénom Equipe'!A:B,2,FALSE)","v":" "},77]
["Equipe N°78",0,{"$f":"VLOOKUP(A79,'Nom Prénom Equipe'!A:B,2,FALSE)","v":" "},78]
["Equipe N°79",0,{"$f":"VLOOKUP(A80,'Nom Prénom Equipe'!A:B,2,FALSE)","v":" "},79]
["Equipe N°80",0,{"$f":"VLOOKUP(A81,'Nom Prénom Equipe'!A:B,2,FALSE)","v":" "},80]
["Equipe N°81",0,{"$f":"VLOOKUP(A82,'Nom Prénom Equipe'!A:B,2,FALSE)","v":" "},81]
["Equipe N°82",0,{"$f":"VLOOKUP(A83,'Nom Prénom Equipe'!A:B,2,FALSE)","v":" "},82]
["Equipe N°83",0,{"$f":"VLOOKUP(A84,'Nom Prénom Equipe'!A:B,2,FALSE)","v":" "},83]
["Equipe N°84",0,{"$f":"VLOOKUP(A85,'Nom Prénom Equipe'!A:B,2,FALSE)","v":" "},84]
["Equipe N°85",0,{"$f":"VLOOKUP(A86,'Nom Prénom Equipe'!A:B,2,FALSE)","v":" "},85]
["Equipe N°86",0,{"$f":"VLOOKUP(A87,'Nom Prénom Equipe'!A:B,2,FALSE)","v":" "},86]
["Equipe N°87",0,{"$f":"VLOOKUP(A88,'Nom Prénom Equipe'!A:B,2,FALSE)","v":" "},87]
["Equipe N°88",0,{"$f":"VLOOKUP(A89,'Nom Prénom Equipe'!A:B,2,FALSE)","v":" "},88]
["Equipe N°89",0,{"$f":"VLOOKUP(A90,'Nom Prénom Equipe'!A:B,2,FALSE)","v":" "},89]
["Equipe N°90",0,{"$f":"VLOOKUP(A91,'Nom Prénom Equipe'!A:B,2,FALSE)","v":" "},90]
[null,0]
[null,0]
[null,0]
[null,0]
[null,0]
[null,0]
[null,0]
[null,0]
[null,0]
[null,0]

{"sheet":"Classement après 2ème partie","index":3,"n_rows":101,"n_cols":4,"rows_kept":101,"cut":false,"hidden":false,"merged":[]}
["Numéro d'équipe","Points","Noms équipe","Rang"]
["Equipe N°1",0,{"$f":"VLOOKUP(A2,'Nom Prénom Equipe'!A:B,2,FALSE)","v":0},1]
["Equipe N°2",0,{"$f":"VLOOKUP(A3,'Nom Prénom Equipe'!A:B,2,FALSE)","v":0},2]
["Equipe N°3",0,{"$f":"VLOOKUP(A4,'Nom Prénom Equipe'!A:B,2,FALSE)","v":0},3]
["Equipe N°4",0,{"$f":"VLOOKUP(A5,'Nom Prénom Equipe'!A:B,2,FALSE)","v":0},4]
["Equipe N°5",0,{"$f":"VLOOKUP(A6,'Nom Prénom Equipe'!A:B,2,FALSE)","v":0},5]
["Equipe N°6",0,{"$f":"VLOOKUP(A7,'Nom Prénom Equipe'!A:B,2,FALSE)","v":0},6]
["Equipe N°7",0,{"$f":"VLOOKUP(A8,'Nom Prénom Equipe'!A:B,2,FALSE)","v":0},7]
["Equipe N°8",0,{"$f":"VLOOKUP(A9,'Nom Prénom Equipe'!A:B,2,FALSE)","v":0},8]
["Equipe N°9",0,{"$f":"VLOOKUP(A10,'Nom Prénom Equipe'!A:B,2,FALSE)","v":0},9]
["Equipe N°10",0,{"$f":"VLOOKUP(A11,'Nom Prénom Equipe'!A:B,2,FALSE)","v":0},10]
["Equipe N°11",0,{"$f":"VLOOKUP(A12,'Nom Prénom Equipe'!A:B,2,FALSE)","v":0},11]
["Equipe N°12",0,{"$f":"VLOOKUP(A13,'Nom Prénom Equipe'!A:B,2,FALSE)","v":0},12]
["Equipe N°13",0,{"$f":"VLOOKUP(A14,'Nom Prénom Equipe'!A:B,2,FALSE)","v":0},13]
["Equipe N°14",0,{"$f":"VLOOKUP(A15,'Nom Prénom Equipe'!A:B,2,FALSE)","v":0},14]
["Equipe N°15",0,{"$f":"VLOOKUP(A16,'Nom Prénom Equipe'!A:B,2,FALSE)","v":0},15]
["Equipe N°16",0,{"$f":"VLOOKUP(A17,'Nom Prénom Equipe'!A:B,2,FALSE)","v":0},16]
["Equipe N°17",0,{"$f":"VLOOKUP(A18,'Nom Prénom Equipe'!A:B,2,FALSE)","v":0},17]
["Equipe N°18",0,{"$f":"VLOOKUP(A19,'Nom Prénom Equipe'!A:B,2,FALSE)","v":0},18]
["Equipe N°19",0,{"$f":"VLOOKUP(A20,'Nom Prénom Equipe'!A:B,2,FALSE)","v":0},19]
["Equipe N°20",0,{"$f":"VLOOKUP(A21,'Nom Prénom Equipe'!A:B,2,FALSE)","v":0},20]
["Equipe N°21",0,{"$f":"VLOOKUP(A22,'Nom Prénom Equipe'!A:B,2,FALSE)","v":0},21]
["Equipe N°22",0,{"$f":"VLOOKUP(A23,'Nom Prénom Equipe'!A:B,2,FALSE)","v":0},22]
["Equipe N°23",0,{"$f":"VLOOKUP(A24,'Nom Prénom Equipe'!A:B,2,FALSE)","v":0},23]
["Equipe N°24",0,{"$f":"VLOOKUP(A25,'Nom Prénom Equipe'!A:B,2,FALSE)","v":0},24]
["Equipe N°25",0,{"$f":"VLOOKUP(A26,'Nom Prénom Equipe'!A:B,2,FALSE)","v":0},25]
["Equipe N°26",0,{"$f":"VLOOKUP(A27,'Nom Prénom Equipe'!A:B,2,FALSE)","v":0},26]
["Equipe N°27",0,{"$f":"VLOOKUP(A28,'Nom Prénom Equipe'!A:B,2,FALSE)","v":0},27]
["Equipe N°28",0,{"$f":"VLOOKUP(A29,'Nom Prénom Equipe'!A:B,2,FALSE)","v":0},28]
["Equipe N°29",0,{"$f":"VLOOKUP(A30,'Nom Prénom Equipe'!A:B,2,FALSE)","v":0},29]
["Equipe N°30",0,{"$f":"VLOOKUP(A31,'Nom Prénom Equipe'!A:B,2,FALSE)","v":0},30]
["Equipe N°31",0,{"$f":"VLOOKUP(A32,'Nom Prénom Equipe'!A:B,2,FALSE)","v":0},31]
["Equipe N°32",0,{"$f":"VLOOKUP(A33,'Nom Prénom Equipe'!A:B,2,FALSE)","v":0},32]
["Equipe N°33",0,{"$f":"VLOOKUP(A34,'Nom Prénom Equipe'!A:B,2,FALSE)","v":0},33]
["Equipe N°34",0,{"$f":"VLOOKUP(A35,'Nom Prénom Equipe'!A:B,2,FALSE)","v":0},34]
["Equipe N°35",0,{"$f":"VLOOKUP(A36,'Nom Prénom Equipe'!A:B,2,FALSE)","v":0},35]
["Equipe N°36",0,{"$f":"VLOOKUP(A37,'Nom Prénom Equipe'!A:B,2,FALSE)","v":0},36]
["Equipe N°37",0,{"$f":"VLOOKUP(A38,'Nom Prénom Equipe'!A:B,2,FALSE)","v":0},37]
["Equipe N°38",0,{"$f":"VLOOKUP(A39,'Nom Prénom Equipe'!A:B,2,FALSE)","v":0},38]
["Equipe N°39",0,{"$f":"VLOOKUP(A40,'Nom Prénom Equipe'!A:B,2,FALSE)","v":0},39]
["Equipe N°40",0,{"$f":"VLOOKUP(A41,'Nom Prénom Equipe'!A:B,2,FALSE)","v":0},40]
["Equipe N°41",0,{"$f":"VLOOKUP(A42,'Nom Prénom Equipe'!A:B,2,FALSE)","v":0},41]
["Equipe N°42",0,{"$f":"VLOOKUP(A43,'Nom Prénom Equipe'!A:B,2,FALSE)","v":0},42]
["Equipe N°43",0,{"$f":"VLOOKUP(A44,'Nom Prénom Equipe'!A:B,2,FALSE)","v":0},43]
["Equipe N°44",0,{"$f":"VLOOKUP(A45,'Nom Prénom Equipe'!A:B,2,FALSE)","v":0},44]
["Equipe N°45",0,{"$f":"VLOOKUP(A46,'Nom Prénom Equipe'!A:B,2,FALSE)","v":0},45]
["Equipe N°46",0,{"$f":"VLOOKUP(A47,'Nom Prénom Equipe'!A:B,2,FALSE)","v":0},46]
["Equipe N°47",0,{"$f":"VLOOKUP(A48,'Nom Prénom Equipe'!A:B,2,FALSE)","v":0},47]
["Equipe N°48",0,{"$f":"VLOOKUP(A49,'Nom Prénom Equipe'!A:B,2,FALSE)","v":0},48]
["Equipe N°49",0,{"$f":"VLOOKUP(A50,'Nom Prénom Equipe'!A:B,2,FALSE)","v":0},49]
["Equipe N°50",0,{"$f":"VLOOKUP(A51,'Nom Prénom Equipe'!A:B,2,FALSE)","v":0},50]
["Equipe N°51",0,{"$f":"VLOOKUP(A52,'Nom Prénom Equipe'!A:B,2,FALSE)","v":0},51]
["Equipe N°52",0,{"$f":"VLOOKUP(A53,'Nom Prénom Equipe'!A:B,2,FALSE)","v":" "},52]
["Equipe N°53",0,{"$f":"VLOOKUP(A54,'Nom Prénom Equipe'!A:B,2,FALSE)","v":" "},53]
["Equipe N°54",0,{"$f":"VLOOKUP(A55,'Nom Prénom Equipe'!A:B,2,FALSE)","v":" "},54]
["Equipe N°55",0,{"$f":"VLOOKUP(A56,'Nom Prénom Equipe'!A:B,2,FALSE)","v":" "},55]
["Equipe N°56",0,{"$f":"VLOOKUP(A57,'Nom Prénom Equipe'!A:B,2,FALSE)","v":" "},56]
["Equipe N°57",0,{"$f":"VLOOKUP(A58,'Nom Prénom Equipe'!A:B,2,FALSE)","v":" "},57]
["Equipe N°58",0,{"$f":"VLOOKUP(A59,'Nom Prénom Equipe'!A:B,2,FALSE)","v":" "},58]
["Equipe N°59",0,{"$f":"VLOOKUP(A60,'Nom Prénom Equipe'!A:B,2,FALSE)","v":" "},59]
["Equipe N°60",0,{"$f":"VLOOKUP(A61,'Nom Prénom Equipe'!A:B,2,FALSE)","v":" "},60]
["Equipe N°61",0,{"$f":"VLOOKUP(A62,'Nom Prénom Equipe'!A:B,2,FALSE)","v":" "},61]
["Equipe N°62",0,{"$f":"VLOOKUP(A63,'Nom Prénom Equipe'!A:B,2,FALSE)","v":" "},62]
["Equipe N°63",0,{"$f":"VLOOKUP(A64,'Nom Prénom Equipe'!A:B,2,FALSE)","v":" "},63]
["Equipe N°64",0,{"$f":"VLOOKUP(A65,'Nom Prénom Equipe'!A:B,2,FALSE)","v":" "},64]
["Equipe N°65",0,{"$f":"VLOOKUP(A66,'Nom Prénom Equipe'!A:B,2,FALSE)","v":" "},65]
["Equipe N°66",0,{"$f":"VLOOKUP(A67,'Nom Prénom Equipe'!A:B,2,FALSE)","v":" "},66]
["Equipe N°67",0,{"$f":"VLOOKUP(A68,'Nom Prénom Equipe'!A:B,2,FALSE)","v":" "},67]
["Equipe N°68",0,{"$f":"VLOOKUP(A69,'Nom Prénom Equipe'!A:B,2,FALSE)","v":" "},68]
["Equipe N°69",0,{"$f":"VLOOKUP(A70,'Nom Prénom Equipe'!A:B,2,FALSE)","v":" "},69]
["Equipe N°70",0,{"$f":"VLOOKUP(A71,'Nom Prénom Equipe'!A:B,2,FALSE)","v":" "},70]
["Equipe N°71",0,{"$f":"VLOOKUP(A72,'Nom Prénom Equipe'!A:B,2,FALSE)","v":" "},71]
["Equipe N°72",0,{"$f":"VLOOKUP(A73,'Nom Prénom Equipe'!A:B,2,FALSE)","v":" "},72]
["Equipe N°73",0,{"$f":"VLOOKUP(A74,'Nom Prénom Equipe'!A:B,2,FALSE)","v":" "},73]
["Equipe N°74",0,{"$f":"VLOOKUP(A75,'Nom Prénom Equipe'!A:B,2,FALSE)","v":" "},74]
["Equipe N°75",0,{"$f":"VLOOKUP(A76,'Nom Prénom Equipe'!A:B,2,FALSE)","v":" "},75]
["Equipe N°76",0,{"$f":"VLOOKUP(A77,'Nom Prénom Equipe'!A:B,2,FALSE)","v":" "},76]
["Equipe N°77",0,{"$f":"VLOOKUP(A78,'Nom Prénom Equipe'!A:B,2,FALSE)","v":" "},77]
["Equipe N°78",0,{"$f":"VLOOKUP(A79,'Nom Prénom Equipe'!A:B,2,FALSE)","v":" "},78]
["Equipe N°79",0,{"$f":"VLOOKUP(A80,'Nom Prénom Equipe'!A:B,2,FALSE)","v":" "},79]
["Equipe N°80",0,{"$f":"VLOOKUP(A81,'Nom Prénom Equipe'!A:B,2,FALSE)","v":" "},80]
["Equipe N°81",0,{"$f":"VLOOKUP(A82,'Nom Prénom Equipe'!A:B,2,FALSE)","v":" "},81]
["Equipe N°82",0,{"$f":"VLOOKUP(A83,'Nom Prénom Equipe'!A:B,2,FALSE)","v":" "},82]
["Equipe N°83",0,{"$f":"VLOOKUP(A84,'Nom Prénom Equipe'!A:B,2,FALSE)","v":" "},83]
["Equipe N°84",0,{"$f":"VLOOKUP(A85,'Nom Prénom Equipe'!A:B,2,FALSE)","v":" "},84]
["Equipe N°85",0,{"$f":"VLOOKUP(A86,'Nom Prénom Equipe'!A:B,2,FALSE)","v":" "},85]
["Equipe N°86",0,{"$f":"VLOOKUP(A87,'Nom Prénom Equipe'!A:B,2,FALSE)","v":" "},86]
["Equipe N°87",0,{"$f":"VLOOKUP(A88,'Nom Prénom Equipe'!A:B,2,FALSE)","v":" "},87]
["Equipe N°88",0,{"$f":"VLOOKUP(A89,'Nom Prénom Equipe'!A:B,2,FALSE)","v":" "},88]
["Equipe N°89",0,{"$f":"VLOOKUP(A90,'Nom Prénom Equipe'!A:B,2,FALSE)","v":" "},89]
["Equipe N°90",0,{"$f":"VLOOKUP(A91,'Nom Prénom Equipe'!A:B,2,FALSE)","v":" "},90]
[null,0]
[null,0]
[null,0]
[null,0]
[null,0]
[null,0]
[null,0]
[null,0]
[null,0]
[null,0]

{"sheet":"Classement après 3ème partie","index":4,"n_rows":101,"n_cols":5,"rows_kept":101,"cut":false,"hidden":false,"merged":[[23,4,24,4],[1,4,2,4],[3,4,4,4],[5,4,6,4],[7,4,8,4],[9,4,10,4],[11,4,12,4],[13,4,14,4],[15,4,16,4],[17,4,18,4],[19,4,20,4],[21,4,22,4],[47,4,48,4],[25,4,26,4],[27,4,28,4],[29,4,30,4],[31,4,32,4],[33,4,34,4],[35,4,36,4],[37,4,38,4],[39,4,40,4],[41,4,42,4],[43,4,44,4],[45,4,46,4]]}
["Numéro d'équipe","Points","Noms équipe","Rang","Tables"]
["Equipe N°1",0,{"$f":"VLOOKUP(A2,'Nom Prénom Equipe'!A:B,2,FALSE)","v":0},1,1]
["Equipe N°2",0,{"$f":"VLOOKUP(A3,'Nom Prénom Equipe'!A:B,2,FALSE)","v":0},2]
["Equipe N°3",0,{"$f":"VLOOKUP(A4,'Nom Prénom Equipe'!A:B,2,FALSE)","v":0},3,3]
["Equipe N°4",0,{"$f":"VLOOKUP(A5,'Nom Prénom Equipe'!A:B,2,FALSE)","v":0},4]
["Equipe N°5",0,{"$f":"VLOOKUP(A6,'Nom Prénom Equipe'!A:B,2,FALSE)","v":0},5,5]
["Equipe N°6",0,{"$f":"VLOOKUP(A7,'Nom Prénom Equipe'!A:B,2,FALSE)","v":0},6]
["Equipe N°7",0,{"$f":"VLOOKUP(A8,'Nom Prénom Equipe'!A:B,2,FALSE)","v":0},7,7]
["Equipe N°8",0,{"$f":"VLOOKUP(A9,'Nom Prénom Equipe'!A:B,2,FALSE)","v":0},8]
["Equipe N°9",0,{"$f":"VLOOKUP(A10,'Nom Prénom Equipe'!A:B,2,FALSE)","v":0},9,9]
["Equipe N°10",0,{"$f":"VLOOKUP(A11,'Nom Prénom Equipe'!A:B,2,FALSE)","v":0},10]
["Equipe N°11",0,{"$f":"VLOOKUP(A12,'Nom Prénom Equipe'!A:B,2,FALSE)","v":0},11,11]
["Equipe N°12",0,{"$f":"VLOOKUP(A13,'Nom Prénom Equipe'!A:B,2,FALSE)","v":0},12]
["Equipe N°13",0,{"$f":"VLOOKUP(A14,'Nom Prénom Equipe'!A:B,2,FALSE)","v":0},13,13]
["Equipe N°14",0,{"$f":"VLOOKUP(A15,'Nom Prénom Equipe'!A:B,2,FALSE)","v":0},14]
["Equipe N°15",0,{"$f":"VLOOKUP(A16,'Nom Prénom Equipe'!A:B,2,FALSE)","v":0},15,15]
["Equipe N°16",0,{"$f":"VLOOKUP(A17,'Nom Prénom Equipe'!A:B,2,FALSE)","v":0},16]
["Equipe N°17",0,{"$f":"VLOOKUP(A18,'Nom Prénom Equipe'!A:B,2,FALSE)","v":0},17,17]
["Equipe N°18",0,{"$f":"VLOOKUP(A19,'Nom Prénom Equipe'!A:B,2,FALSE)","v":0},18]
["Equipe N°19",0,{"$f":"VLOOKUP(A20,'Nom Prénom Equipe'!A:B,2,FALSE)","v":0},19,19]
["Equipe N°20",0,{"$f":"VLOOKUP(A21,'Nom Prénom Equipe'!A:B,2,FALSE)","v":0},20]
["Equipe N°21",0,{"$f":"VLOOKUP(A22,'Nom Prénom Equipe'!A:B,2,FALSE)","v":0},21,21]
["Equipe N°22",0,{"$f":"VLOOKUP(A23,'Nom Prénom Equipe'!A:B,2,FALSE)","v":0},22]
["Equipe N°23",0,{"$f":"VLOOKUP(A24,'Nom Prénom Equipe'!A:B,2,FALSE)","v":0},23,23]
["Equipe N°24",0,{"$f":"VLOOKUP(A25,'Nom Prénom Equipe'!A:B,2,FALSE)","v":0},24]
["Equipe N°25",0,{"$f":"VLOOKUP(A26,'Nom Prénom Equipe'!A:B,2,FALSE)","v":0},25,25]
["Equipe N°26",0,{"$f":"VLOOKUP(A27,'Nom Prénom Equipe'!A:B,2,FALSE)","v":0},26]
["Equipe N°27",0,{"$f":"VLOOKUP(A28,'Nom Prénom Equipe'!A:B,2,FALSE)","v":0},27,27]
["Equipe N°28",0,{"$f":"VLOOKUP(A29,'Nom Prénom Equipe'!A:B,2,FALSE)","v":0},28]
["Equipe N°29",0,{"$f":"VLOOKUP(A30,'Nom Prénom Equipe'!A:B,2,FALSE)","v":0},29,29]
["Equipe N°30",0,{"$f":"VLOOKUP(A31,'Nom Prénom Equipe'!A:B,2,FALSE)","v":0},30]
["Equipe N°31",0,{"$f":"VLOOKUP(A32,'Nom Prénom Equipe'!A:B,2,FALSE)","v":0},31,31]
["Equipe N°32",0,{"$f":"VLOOKUP(A33,'Nom Prénom Equipe'!A:B,2,FALSE)","v":0},32]
["Equipe N°33",0,{"$f":"VLOOKUP(A34,'Nom Prénom Equipe'!A:B,2,FALSE)","v":0},33,33]
["Equipe N°34",0,{"$f":"VLOOKUP(A35,'Nom Prénom Equipe'!A:B,2,FALSE)","v":0},34]
["Equipe N°35",0,{"$f":"VLOOKUP(A36,'Nom Prénom Equipe'!A:B,2,FALSE)","v":0},35,35]
["Equipe N°36",0,{"$f":"VLOOKUP(A37,'Nom Prénom Equipe'!A:B,2,FALSE)","v":0},36]
["Equipe N°37",0,{"$f":"VLOOKUP(A38,'Nom Prénom Equipe'!A:B,2,FALSE)","v":0},37,37]
["Equipe N°38",0,{"$f":"VLOOKUP(A39,'Nom Prénom Equipe'!A:B,2,FALSE)","v":0},38]
["Equipe N°39",0,{"$f":"VLOOKUP(A40,'Nom Prénom Equipe'!A:B,2,FALSE)","v":0},39,39]
["Equipe N°40",0,{"$f":"VLOOKUP(A41,'Nom Prénom Equipe'!A:B,2,FALSE)","v":0},40]
["Equipe N°41",0,{"$f":"VLOOKUP(A42,'Nom Prénom Equipe'!A:B,2,FALSE)","v":0},41,41]
["Equipe N°42",0,{"$f":"VLOOKUP(A43,'Nom Prénom Equipe'!A:B,2,FALSE)","v":0},42]
["Equipe N°43",0,{"$f":"VLOOKUP(A44,'Nom Prénom Equipe'!A:B,2,FALSE)","v":0},43,43]
["Equipe N°44",0,{"$f":"VLOOKUP(A45,'Nom Prénom Equipe'!A:B,2,FALSE)","v":0},44]
["Equipe N°45",0,{"$f":"VLOOKUP(A46,'Nom Prénom Equipe'!A:B,2,FALSE)","v":0},45,45]
["Equipe N°46",0,{"$f":"VLOOKUP(A47,'Nom Prénom Equipe'!A:B,2,FALSE)","v":0},46]
["Equipe N°47",0,{"$f":"VLOOKUP(A48,'Nom Prénom Equipe'!A:B,2,FALSE)","v":0},47,47]
["Equipe N°48",0,{"$f":"VLOOKUP(A49,'Nom Prénom Equipe'!A:B,2,FALSE)","v":0},48]
["Equipe N°49",0,{"$f":"VLOOKUP(A50,'Nom Prénom Equipe'!A:B,2,FALSE)","v":0},49,0]
["Equipe N°50",0,{"$f":"VLOOKUP(A51,'Nom Prénom Equipe'!A:B,2,FALSE)","v":0},50,0]
["Equipe N°51",0,{"$f":"VLOOKUP(A52,'Nom Prénom Equipe'!A:B,2,FALSE)","v":0},51,0]
["Equipe N°52",0,{"$f":"VLOOKUP(A53,'Nom Prénom Equipe'!A:B,2,FALSE)","v":" "},52,0]
["Equipe N°53",0,{"$f":"VLOOKUP(A54,'Nom Prénom Equipe'!A:B,2,FALSE)","v":" "},53,0]
["Equipe N°54",0,{"$f":"VLOOKUP(A55,'Nom Prénom Equipe'!A:B,2,FALSE)","v":" "},54,0]
["Equipe N°55",0,{"$f":"VLOOKUP(A56,'Nom Prénom Equipe'!A:B,2,FALSE)","v":" "},55,0]
["Equipe N°56",0,{"$f":"VLOOKUP(A57,'Nom Prénom Equipe'!A:B,2,FALSE)","v":" "},56,0]
["Equipe N°57",0,{"$f":"VLOOKUP(A58,'Nom Prénom Equipe'!A:B,2,FALSE)","v":" "},57,0]
["Equipe N°58",0,{"$f":"VLOOKUP(A59,'Nom Prénom Equipe'!A:B,2,FALSE)","v":" "},58,0]
["Equipe N°59",0,{"$f":"VLOOKUP(A60,'Nom Prénom Equipe'!A:B,2,FALSE)","v":" "},59,0]
["Equipe N°60",0,{"$f":"VLOOKUP(A61,'Nom Prénom Equipe'!A:B,2,FALSE)","v":" "},60,0]
["Equipe N°61",0,{"$f":"VLOOKUP(A62,'Nom Prénom Equipe'!A:B,2,FALSE)","v":" "},61,0]
["Equipe N°62",0,{"$f":"VLOOKUP(A63,'Nom Prénom Equipe'!A:B,2,FALSE)","v":" "},62,0]
["Equipe N°63",0,{"$f":"VLOOKUP(A64,'Nom Prénom Equipe'!A:B,2,FALSE)","v":" "},63,0]
["Equipe N°64",0,{"$f":"VLOOKUP(A65,'Nom Prénom Equipe'!A:B,2,FALSE)","v":" "},64,0]
["Equipe N°65",0,{"$f":"VLOOKUP(A66,'Nom Prénom Equipe'!A:B,2,FALSE)","v":" "},65,0]
["Equipe N°66",0,{"$f":"VLOOKUP(A67,'Nom Prénom Equipe'!A:B,2,FALSE)","v":" "},66,0]
["Equipe N°67",0,{"$f":"VLOOKUP(A68,'Nom Prénom Equipe'!A:B,2,FALSE)","v":" "},67,0]
["Equipe N°68",0,{"$f":"VLOOKUP(A69,'Nom Prénom Equipe'!A:B,2,FALSE)","v":" "},68,0]
["Equipe N°69",0,{"$f":"VLOOKUP(A70,'Nom Prénom Equipe'!A:B,2,FALSE)","v":" "},69,0]
["Equipe N°70",0,{"$f":"VLOOKUP(A71,'Nom Prénom Equipe'!A:B,2,FALSE)","v":" "},70,0]
["Equipe N°71",0,{"$f":"VLOOKUP(A72,'Nom Prénom Equipe'!A:B,2,FALSE)","v":" "},71,0]
["Equipe N°72",0,{"$f":"VLOOKUP(A73,'Nom Prénom Equipe'!A:B,2,FALSE)","v":" "},72,0]
["Equipe N°73",0,{"$f":"VLOOKUP(A74,'Nom Prénom Equipe'!A:B,2,FALSE)","v":" "},73,0]
["Equipe N°74",0,{"$f":"VLOOKUP(A75,'Nom Prénom Equipe'!A:B,2,FALSE)","v":" "},74,0]
["Equipe N°75",0,{"$f":"VLOOKUP(A76,'Nom Prénom Equipe'!A:B,2,FALSE)","v":" "},75,0]
["Equipe N°76",0,{"$f":"VLOOKUP(A77,'Nom Prénom Equipe'!A:B,2,FALSE)","v":" "},76,0]
["Equipe N°77",0,{"$f":"VLOOKUP(A78,'Nom Prénom Equipe'!A:B,2,FALSE)","v":" "},77,0]
["Equipe N°78",0,{"$f":"VLOOKUP(A79,'Nom Prénom Equipe'!A:B,2,FALSE)","v":" "},78,0]
["Equipe N°79",0,{"$f":"VLOOKUP(A80,'Nom Prénom Equipe'!A:B,2,FALSE)","v":" "},79,0]
["Equipe N°80",0,{"$f":"VLOOKUP(A81,'Nom Prénom Equipe'!A:B,2,FALSE)","v":" "},80,0]
["Equipe N°81",0,{"$f":"VLOOKUP(A82,'Nom Prénom Equipe'!A:B,2,FALSE)","v":" "},81,0]
["Equipe N°82",0,{"$f":"VLOOKUP(A83,'Nom Prénom Equipe'!A:B,2,FALSE)","v":" "},82,0]
["Equipe N°83",0,{"$f":"VLOOKUP(A84,'Nom Prénom Equipe'!A:B,2,FALSE)","v":" "},83,0]
["Equipe N°84",0,{"$f":"VLOOKUP(A85,'Nom Prénom Equipe'!A:B,2,FALSE)","v":" "},84,0]
["Equipe N°85",0,{"$f":"VLOOKUP(A86,'Nom Prénom Equipe'!A:B,2,FALSE)","v":" "},85,0]
["Equipe N°86",0,{"$f":"VLOOKUP(A87,'Nom Prénom Equipe'!A:B,2,FALSE)","v":" "},86,0]
["Equipe N°87",0,{"$f":"VLOOKUP(A88,'Nom Prénom Equipe'!A:B,2,FALSE)","v":" "},87,0]
["Equipe N°88",0,{"$f":"VLOOKUP(A89,'Nom Prénom Equipe'!A:B,2,FALSE)","v":" "},88,0]
["Equipe N°89",0,{"$f":"VLOOKUP(A90,'Nom Prénom Equipe'!A:B,2,FALSE)","v":" "},89,0]
["Equipe N°90",0,{"$f":"VLOOKUP(A91,'Nom Prénom Equipe'!A:B,2,FALSE)","v":" "},90,0]
[null,0,null,null,0]
[null,0,null,null,0]
[null,0,null,null,0]
[null,0,null,null,0]
[null,0,null,null,0]
[null,0,null,null,0]
[null,0,null,null,0]
[null,0,null,null,0]
[null,0,null,null,0]
[null,0,null,null,0]

{"sheet":"Tirage des tables","index":5,"n_rows":101,"n_cols":5,"rows_kept":101,"cut":false,"hidden":false,"merged":[[23,1,24,1],[1,1,2,1],[3,1,4,1],[5,1,6,1],[7,1,8,1],[9,1,10,1],[11,1,12,1],[13,1,14,1],[15,1,16,1],[17,1,18,1],[19,1,20,1],[21,1,22,1],[47,1,48,1],[25,1,26,1],[27,1,28,1],[29,1,30,1],[31,1,32,1],[33,1,34,1],[35,1,36,1],[37,1,38,1],[39,1,40,1],[41,1,42,1],[43,1,44,1],[45,1,46,1]]}
["Numéro d'équipe","Tables","Noms équipe","Rang"," "]
["Equipe N°1",1,{"$f":"VLOOKUP(A2,'Nom Prénom Equipe'!A:B,2,FALSE)","v":0},1]
["Equipe N°2",null,{"$f":"VLOOKUP(A3,'Nom Prénom Equipe'!A:B,2,FALSE)","v":0},2]
["Equipe N°3",3,{"$f":"VLOOKUP(A4,'Nom Prénom Equipe'!A:B,2,FALSE)","v":0},3]
["Equipe N°4",null,{"$f":"VLOOKUP(A5,'Nom Prénom Equipe'!A:B,2,FALSE)","v":0},4]
["Equipe N°5",5,{"$f":"VLOOKUP(A6,'Nom Prénom Equipe'!A:B,2,FALSE)","v":0},5]
["Equipe N°6",null,{"$f":"VLOOKUP(A7,'Nom Prénom Equipe'!A:B,2,FALSE)","v":0},6]
["Equipe N°7",7,{"$f":"VLOOKUP(A8,'Nom Prénom Equipe'!A:B,2,FALSE)","v":0},7]
["Equipe N°8",null,{"$f":"VLOOKUP(A9,'Nom Prénom Equipe'!A:B,2,FALSE)","v":0},8]
["Equipe N°9",9,{"$f":"VLOOKUP(A10,'Nom Prénom Equipe'!A:B,2,FALSE)","v":0},9]
["Equipe N°10",null,{"$f":"VLOOKUP(A11,'Nom Prénom Equipe'!A:B,2,FALSE)","v":0},10]
["Equipe N°11",11,{"$f":"VLOOKUP(A12,'Nom Prénom Equipe'!A:B,2,FALSE)","v":0},11]
["Equipe N°12",null,{"$f":"VLOOKUP(A13,'Nom Prénom Equipe'!A:B,2,FALSE)","v":0},12]
["Equipe N°13",13,{"$f":"VLOOKUP(A14,'Nom Prénom Equipe'!A:B,2,FALSE)","v":0},13]
["Equipe N°14",null,{"$f":"VLOOKUP(A15,'Nom Prénom Equipe'!A:B,2,FALSE)","v":0},14]
["Equipe N°15",15,{"$f":"VLOOKUP(A16,'Nom Prénom Equipe'!A:B,2,FALSE)","v":0},15]
["Equipe N°16",null,{"$f":"VLOOKUP(A17,'Nom Prénom Equipe'!A:B,2,FALSE)","v":0},16]
["Equipe N°17",17,{"$f":"VLOOKUP(A18,'Nom Prénom Equipe'!A:B,2,FALSE)","v":0},17]
["Equipe N°18",null,{"$f":"VLOOKUP(A19,'Nom Prénom Equipe'!A:B,2,FALSE)","v":0},18]
["Equipe N°19",19,{"$f":"VLOOKUP(A20,'Nom Prénom Equipe'!A:B,2,FALSE)","v":0},19]
["Equipe N°20",null,{"$f":"VLOOKUP(A21,'Nom Prénom Equipe'!A:B,2,FALSE)","v":0},20]
["Equipe N°21",21,{"$f":"VLOOKUP(A22,'Nom Prénom Equipe'!A:B,2,FALSE)","v":0},21]
["Equipe N°22",null,{"$f":"VLOOKUP(A23,'Nom Prénom Equipe'!A:B,2,FALSE)","v":0},22]
["Equipe N°23",23,{"$f":"VLOOKUP(A24,'Nom Prénom Equipe'!A:B,2,FALSE)","v":0},23]
["Equipe N°24",null,{"$f":"VLOOKUP(A25,'Nom Prénom Equipe'!A:B,2,FALSE)","v":0},24]
["Equipe N°25",25,{"$f":"VLOOKUP(A26,'Nom Prénom Equipe'!A:B,2,FALSE)","v":0},25]
["Equipe N°26",null,{"$f":"VLOOKUP(A27,'Nom Prénom Equipe'!A:B,2,FALSE)","v":0},26]
["Equipe N°27",27,{"$f":"VLOOKUP(A28,'Nom Prénom Equipe'!A:B,2,FALSE)","v":0},27]
["Equipe N°28",null,{"$f":"VLOOKUP(A29,'Nom Prénom Equipe'!A:B,2,FALSE)","v":0},28]
["Equipe N°29",29,{"$f":"VLOOKUP(A30,'Nom Prénom Equipe'!A:B,2,FALSE)","v":0},29]
["Equipe N°30",null,{"$f":"VLOOKUP(A31,'Nom Prénom Equipe'!A:B,2,FALSE)","v":0},30]
["Equipe N°31",31,{"$f":"VLOOKUP(A32,'Nom Prénom Equipe'!A:B,2,FALSE)","v":0},31]
["Equipe N°32",null,{"$f":"VLOOKUP(A33,'Nom Prénom Equipe'!A:B,2,FALSE)","v":0},32]
["Equipe N°33",33,{"$f":"VLOOKUP(A34,'Nom Prénom Equipe'!A:B,2,FALSE)","v":0},33]
["Equipe N°34",null,{"$f":"VLOOKUP(A35,'Nom Prénom Equipe'!A:B,2,FALSE)","v":0},34]
["Equipe N°35",35,{"$f":"VLOOKUP(A36,'Nom Prénom Equipe'!A:B,2,FALSE)","v":0},35]
["Equipe N°36",null,{"$f":"VLOOKUP(A37,'Nom Prénom Equipe'!A:B,2,FALSE)","v":0},36]
["Equipe N°37",37,{"$f":"VLOOKUP(A38,'Nom Prénom Equipe'!A:B,2,FALSE)","v":0},37]
["Equipe N°38",null,{"$f":"VLOOKUP(A39,'Nom Prénom Equipe'!A:B,2,FALSE)","v":0},38]
["Equipe N°39",39,{"$f":"VLOOKUP(A40,'Nom Prénom Equipe'!A:B,2,FALSE)","v":0},39]
["Equipe N°40",null,{"$f":"VLOOKUP(A41,'Nom Prénom Equipe'!A:B,2,FALSE)","v":0},40]
["Equipe N°41",41,{"$f":"VLOOKUP(A42,'Nom Prénom Equipe'!A:B,2,FALSE)","v":0},41]
["Equipe N°42",null,{"$f":"VLOOKUP(A43,'Nom Prénom Equipe'!A:B,2,FALSE)","v":0},42]
["Equipe N°43",43,{"$f":"VLOOKUP(A44,'Nom Prénom Equipe'!A:B,2,FALSE)","v":0},43]
["Equipe N°44",null,{"$f":"VLOOKUP(A45,'Nom Prénom Equipe'!A:B,2,FALSE)","v":0},44]
["Equipe N°45",45,{"$f":"VLOOKUP(A46,'Nom Prénom Equipe'!A:B,2,FALSE)","v":0},45]
["Equipe N°46",null,{"$f":"VLOOKUP(A47,'Nom Prénom Equipe'!A:B,2,FALSE)","v":0},46]
["Equipe N°47",47,{"$f":"VLOOKUP(A48,'Nom Prénom Equipe'!A:B,2,FALSE)","v":0},47]
["Equipe N°48",null,{"$f":"VLOOKUP(A49,'Nom Prénom Equipe'!A:B,2,FALSE)","v":0},48]
["Equipe N°49",0,{"$f":"VLOOKUP(A50,'Nom Prénom Equipe'!A:B,2,FALSE)","v":0},49]
["Equipe N°50",0,{"$f":"VLOOKUP(A51,'Nom Prénom Equipe'!A:B,2,FALSE)","v":0},50]
["Equipe N°51",0,{"$f":"VLOOKUP(A52,'Nom Prénom Equipe'!A:B,2,FALSE)","v":0},51]
["Equipe N°52",0,{"$f":"VLOOKUP(A53,'Nom Prénom Equipe'!A:B,2,FALSE)","v":" "},52]
["Equipe N°53",0,{"$f":"VLOOKUP(A54,'Nom Prénom Equipe'!A:B,2,FALSE)","v":" "},53]
["Equipe N°54",0,{"$f":"VLOOKUP(A55,'Nom Prénom Equipe'!A:B,2,FALSE)","v":" "},54]
["Equipe N°55",0,{"$f":"VLOOKUP(A56,'Nom Prénom Equipe'!A:B,2,FALSE)","v":" "},55]
["Equipe N°56",0,{"$f":"VLOOKUP(A57,'Nom Prénom Equipe'!A:B,2,FALSE)","v":" "},56]
["Equipe N°57",0,{"$f":"VLOOKUP(A58,'Nom Prénom Equipe'!A:B,2,FALSE)","v":" "},57]
["Equipe N°58",0,{"$f":"VLOOKUP(A59,'Nom Prénom Equipe'!A:B,2,FALSE)","v":" "},58]
["Equipe N°59",0,{"$f":"VLOOKUP(A60,'Nom Prénom Equipe'!A:B,2,FALSE)","v":" "},59]
["Equipe N°60",0,{"$f":"VLOOKUP(A61,'Nom Prénom Equipe'!A:B,2,FALSE)","v":" "},60]
["Equipe N°61",0,{"$f":"VLOOKUP(A62,'Nom Prénom Equipe'!A:B,2,FALSE)","v":" "},61]
["Equipe N°62",0,{"$f":"VLOOKUP(A63,'Nom Prénom Equipe'!A:B,2,FALSE)","v":" "},62]
["Equipe N°63",0,{"$f":"VLOOKUP(A64,'Nom Prénom Equipe'!A:B,2,FALSE)","v":" "},63]
["Equipe N°64",0,{"$f":"VLOOKUP(A65,'Nom Prénom Equipe'!A:B,2,FALSE)","v":" "},64]
["Equipe N°65",0,{"$f":"VLOOKUP(A66,'Nom Prénom Equipe'!A:B,2,FALSE)","v":" "},65]
["Equipe N°66",0,{"$f":"VLOOKUP(A67,'Nom Prénom Equipe'!A:B,2,FALSE)","v":" "},66]
["Equipe N°67",0,{"$f":"VLOOKUP(A68,'Nom Prénom Equipe'!A:B,2,FALSE)","v":" "},67]
["Equipe N°68",0,{"$f":"VLOOKUP(A69,'Nom Prénom Equipe'!A:B,2,FALSE)","v":" "},68]
["Equipe N°69",0,{"$f":"VLOOKUP(A70,'Nom Prénom Equipe'!A:B,2,FALSE)","v":" "},69]
["Equipe N°70",0,{"$f":"VLOOKUP(A71,'Nom Prénom Equipe'!A:B,2,FALSE)","v":" "},70]
["Equipe N°71",0,{"$f":"VLOOKUP(A72,'Nom Prénom Equipe'!A:B,2,FALSE)","v":" "},71]
["Equipe N°72",0,{"$f":"VLOOKUP(A73,'Nom Prénom Equipe'!A:B,2,FALSE)","v":" "},72]
["Equipe N°73",0,{"$f":"VLOOKUP(A74,'Nom Prénom Equipe'!A:B,2,FALSE)","v":" "},73]
["Equipe N°74",0,{"$f":"VLOOKUP(A75,'Nom Prénom Equipe'!A:B,2,FALSE)","v":" "},74]
["Equipe N°75",0,{"$f":"VLOOKUP(A76,'Nom Prénom Equipe'!A:B,2,FALSE)","v":" "},75]
["Equipe N°76",0,{"$f":"VLOOKUP(A77,'Nom Prénom Equipe'!A:B,2,FALSE)","v":" "},76]
["Equipe N°77",0,{"$f":"VLOOKUP(A78,'Nom Prénom Equipe'!A:B,2,FALSE)","v":" "},77]
["Equipe N°78",0,{"$f":"VLOOKUP(A79,'Nom Prénom Equipe'!A:B,2,FALSE)","v":" "},78]
["Equipe N°79",0,{"$f":"VLOOKUP(A80,'Nom Prénom Equipe'!A:B,2,FALSE)","v":" "},79]
["Equipe N°80",0,{"$f":"VLOOKUP(A81,'Nom Prénom Equipe'!A:B,2,FALSE)","v":" "},80]
["Equipe N°81",0,{"$f":"VLOOKUP(A82,'Nom Prénom Equipe'!A:B,2,FALSE)","v":" "},81]
["Equipe N°82",0,{"$f":"VLOOKUP(A83,'Nom Prénom Equipe'!A:B,2,FALSE)","v":" "},82]
["Equipe N°83",0,{"$f":"VLOOKUP(A84,'Nom Prénom Equipe'!A:B,2,FALSE)","v":" "},83]
["Equipe N°84",0,{"$f":"VLOOKUP(A85,'Nom Prénom Equipe'!A:B,2,FALSE)","v":" "},84]
["Equipe N°85",0,{"$f":"VLOOKUP(A86,'Nom Prénom Equipe'!A:B,2,FALSE)","v":" "},85]
["Equipe N°86",0,{"$f":"VLOOKUP(A87,'Nom Prénom Equipe'!A:B,2,FALSE)","v":" "},86]
["Equipe N°87",0,{"$f":"VLOOKUP(A88,'Nom Prénom Equipe'!A:B,2,FALSE)","v":" "},87]
["Equipe N°88",0,{"$f":"VLOOKUP(A89,'Nom Prénom Equipe'!A:B,2,FALSE)","v":" "},88]
["Equipe N°89",0,{"$f":"VLOOKUP(A90,'Nom Prénom Equipe'!A:B,2,FALSE)","v":" "},89]
["Equipe N°90",0,{"$f":"VLOOKUP(A91,'Nom Prénom Equipe'!A:B,2,FALSE)","v":" "},90]
[null,0]
[null,0]
[null,0]
[null,0]
[null,0]
[null,0]
[null,0]
[null,0]
[null,0]
[null,0]

{"sheet":"Classement final","index":6,"n_rows":101,"n_cols":4,"rows_kept":101,"cut":false,"hidden":false,"merged":[]}
["Numéro d'équipe","Points","Noms équipe","Rang"]
["Equipe N°1",0,{"$f":"VLOOKUP(A2,'Nom Prénom Equipe'!A:B,2,FALSE)","v":0},1]
["Equipe N°2",0,{"$f":"VLOOKUP(A3,'Nom Prénom Equipe'!A:B,2,FALSE)","v":0},2]
["Equipe N°3",0,{"$f":"VLOOKUP(A4,'Nom Prénom Equipe'!A:B,2,FALSE)","v":0},3]
["Equipe N°4",0,{"$f":"VLOOKUP(A5,'Nom Prénom Equipe'!A:B,2,FALSE)","v":0},4]
["Equipe N°5",0,{"$f":"VLOOKUP(A6,'Nom Prénom Equipe'!A:B,2,FALSE)","v":0},5]
["Equipe N°6",0,{"$f":"VLOOKUP(A7,'Nom Prénom Equipe'!A:B,2,FALSE)","v":0},6]
["Equipe N°7",0,{"$f":"VLOOKUP(A8,'Nom Prénom Equipe'!A:B,2,FALSE)","v":0},7]
["Equipe N°8",0,{"$f":"VLOOKUP(A9,'Nom Prénom Equipe'!A:B,2,FALSE)","v":0},8]
["Equipe N°9",0,{"$f":"VLOOKUP(A10,'Nom Prénom Equipe'!A:B,2,FALSE)","v":0},9]
["Equipe N°10",0,{"$f":"VLOOKUP(A11,'Nom Prénom Equipe'!A:B,2,FALSE)","v":0},10]
["Equipe N°11",0,{"$f":"VLOOKUP(A12,'Nom Prénom Equipe'!A:B,2,FALSE)","v":0},11]
["Equipe N°12",0,{"$f":"VLOOKUP(A13,'Nom Prénom Equipe'!A:B,2,FALSE)","v":0},12]
["Equipe N°13",0,{"$f":"VLOOKUP(A14,'Nom Prénom Equipe'!A:B,2,FALSE)","v":0},13]
["Equipe N°14",0,{"$f":"VLOOKUP(A15,'Nom Prénom Equipe'!A:B,2,FALSE)","v":0},14]
["Equipe N°15",0,{"$f":"VLOOKUP(A16,'Nom Prénom Equipe'!A:B,2,FALSE)","v":0},15]
["Equipe N°16",0,{"$f":"VLOOKUP(A17,'Nom Prénom Equipe'!A:B,2,FALSE)","v":0},16]
["Equipe N°17",0,{"$f":"VLOOKUP(A18,'Nom Prénom Equipe'!A:B,2,FALSE)","v":0},17]
["Equipe N°18",0,{"$f":"VLOOKUP(A19,'Nom Prénom Equipe'!A:B,2,FALSE)","v":0},18]
["Equipe N°19",0,{"$f":"VLOOKUP(A20,'Nom Prénom Equipe'!A:B,2,FALSE)","v":0},19]
["Equipe N°20",0,{"$f":"VLOOKUP(A21,'Nom Prénom Equipe'!A:B,2,FALSE)","v":0},20]
["Equipe N°21",0,{"$f":"VLOOKUP(A22,'Nom Prénom Equipe'!A:B,2,FALSE)","v":0},21]
["Equipe N°22",0,{"$f":"VLOOKUP(A23,'Nom Prénom Equipe'!A:B,2,FALSE)","v":0},22]
["Equipe N°23",0,{"$f":"VLOOKUP(A24,'Nom Prénom Equipe'!A:B,2,FALSE)","v":0},23]
["Equipe N°24",0,{"$f":"VLOOKUP(A25,'Nom Prénom Equipe'!A:B,2,FALSE)","v":0},24]
["Equipe N°25",0,{"$f":"VLOOKUP(A26,'Nom Prénom Equipe'!A:B,2,FALSE)","v":0},25]
["Equipe N°26",0,{"$f":"VLOOKUP(A27,'Nom Prénom Equipe'!A:B,2,FALSE)","v":0},26]
["Equipe N°27",0,{"$f":"VLOOKUP(A28,'Nom Prénom Equipe'!A:B,2,FALSE)","v":0},27]
["Equipe N°28",0,{"$f":"VLOOKUP(A29,'Nom Prénom Equipe'!A:B,2,FALSE)","v":0},28]
["Equipe N°29",0,{"$f":"VLOOKUP(A30,'Nom Prénom Equipe'!A:B,2,FALSE)","v":0},29]
["Equipe N°30",0,{"$f":"VLOOKUP(A31,'Nom Prénom Equipe'!A:B,2,FALSE)","v":0},30]
["Equipe N°31",0,{"$f":"VLOOKUP(A32,'Nom Prénom Equipe'!A:B,2,FALSE)","v":0},31]
["Equipe N°32",0,{"$f":"VLOOKUP(A33,'Nom Prénom Equipe'!A:B,2,FALSE)","v":0},32]
["Equipe N°33",0,{"$f":"VLOOKUP(A34,'Nom Prénom Equipe'!A:B,2,FALSE)","v":0},33]
["Equipe N°34",0,{"$f":"VLOOKUP(A35,'Nom Prénom Equipe'!A:B,2,FALSE)","v":0},34]
["Equipe N°35",0,{"$f":"VLOOKUP(A36,'Nom Prénom Equipe'!A:B,2,FALSE)","v":0},35]
["Equipe N°36",0,{"$f":"VLOOKUP(A37,'Nom Prénom Equipe'!A:B,2,FALSE)","v":0},36]
["Equipe N°37",0,{"$f":"VLOOKUP(A38,'Nom Prénom Equipe'!A:B,2,FALSE)","v":0},37]
["Equipe N°38",0,{"$f":"VLOOKUP(A39,'Nom Prénom Equipe'!A:B,2,FALSE)","v":0},38]
["Equipe N°39",0,{"$f":"VLOOKUP(A40,'Nom Prénom Equipe'!A:B,2,FALSE)","v":0},39]
["Equipe N°40",0,{"$f":"VLOOKUP(A41,'Nom Prénom Equipe'!A:B,2,FALSE)","v":0},40]
["Equipe N°41",0,{"$f":"VLOOKUP(A42,'Nom Prénom Equipe'!A:B,2,FALSE)","v":0},41]
["Equipe N°42",0,{"$f":"VLOOKUP(A43,'Nom Prénom Equipe'!A:B,2,FALSE)","v":0},42]
["Equipe N°43",0,{"$f":"VLOOKUP(A44,'Nom Prénom Equipe'!A:B,2,FALSE)","v":0},43]
["Equipe N°44",0,{"$f":"VLOOKUP(A45,'Nom Prénom Equipe'!A:B,2,FALSE)","v":0},44]
["Equipe N°45",0,{"$f":"VLOOKUP(A46,'Nom Prénom Equipe'!A:B,2,FALSE)","v":0},45]
["Equipe N°46",0,{"$f":"VLOOKUP(A47,'Nom Prénom Equipe'!A:B,2,FALSE)","v":0},46]
["Equipe N°47",0,{"$f":"VLOOKUP(A48,'Nom Prénom Equipe'!A:B,2,FALSE)","v":0},47]
["Equipe N°48",0,{"$f":"VLOOKUP(A49,'Nom Prénom Equipe'!A:B,2,FALSE)","v":0},48]
["Equipe N°49",0,{"$f":"VLOOKUP(A50,'Nom Prénom Equipe'!A:B,2,FALSE)","v":0},49]
["Equipe N°50",0,{"$f":"VLOOKUP(A51,'Nom Prénom Equipe'!A:B,2,FALSE)","v":0},50]
["Equipe N°51",0,{"$f":"VLOOKUP(A52,'Nom Prénom Equipe'!A:B,2,FALSE)","v":0},51]
["Equipe N°52",0,{"$f":"VLOOKUP(A53,'Nom Prénom Equipe'!A:B,2,FALSE)","v":" "},52]
["Equipe N°53",0,{"$f":"VLOOKUP(A54,'Nom Prénom Equipe'!A:B,2,FALSE)","v":" "},53]
["Equipe N°54",0,{"$f":"VLOOKUP(A55,'Nom Prénom Equipe'!A:B,2,FALSE)","v":" "},54]
["Equipe N°55",0,{"$f":"VLOOKUP(A56,'Nom Prénom Equipe'!A:B,2,FALSE)","v":" "},55]
["Equipe N°56",0,{"$f":"VLOOKUP(A57,'Nom Prénom Equipe'!A:B,2,FALSE)","v":" "},56]
["Equipe N°57",0,{"$f":"VLOOKUP(A58,'Nom Prénom Equipe'!A:B,2,FALSE)","v":" "},57]
["Equipe N°58",0,{"$f":"VLOOKUP(A59,'Nom Prénom Equipe'!A:B,2,FALSE)","v":" "},58]
["Equipe N°59",0,{"$f":"VLOOKUP(A60,'Nom Prénom Equipe'!A:B,2,FALSE)","v":" "},59]
["Equipe N°60",0,{"$f":"VLOOKUP(A61,'Nom Prénom Equipe'!A:B,2,FALSE)","v":" "},60]
["Equipe N°61",0,{"$f":"VLOOKUP(A62,'Nom Prénom Equipe'!A:B,2,FALSE)","v":" "},61]
["Equipe N°62",0,{"$f":"VLOOKUP(A63,'Nom Prénom Equipe'!A:B,2,FALSE)","v":" "},62]
["Equipe N°63",0,{"$f":"VLOOKUP(A64,'Nom Prénom Equipe'!A:B,2,FALSE)","v":" "},63]
["Equipe N°64",0,{"$f":"VLOOKUP(A65,'Nom Prénom Equipe'!A:B,2,FALSE)","v":" "},64]
["Equipe N°65",0,{"$f":"VLOOKUP(A66,'Nom Prénom Equipe'!A:B,2,FALSE)","v":" "},65]
["Equipe N°66",0,{"$f":"VLOOKUP(A67,'Nom Prénom Equipe'!A:B,2,FALSE)","v":" "},66]
["Equipe N°67",0,{"$f":"VLOOKUP(A68,'Nom Prénom Equipe'!A:B,2,FALSE)","v":" "},67]
["Equipe N°68",0,{"$f":"VLOOKUP(A69,'Nom Prénom Equipe'!A:B,2,FALSE)","v":" "},68]
["Equipe N°69",0,{"$f":"VLOOKUP(A70,'Nom Prénom Equipe'!A:B,2,FALSE)","v":" "},69]
["Equipe N°70",0,{"$f":"VLOOKUP(A71,'Nom Prénom Equipe'!A:B,2,FALSE)","v":" "},70]
["Equipe N°71",0,{"$f":"VLOOKUP(A72,'Nom Prénom Equipe'!A:B,2,FALSE)","v":" "},71]
["Equipe N°72",0,{"$f":"VLOOKUP(A73,'Nom Prénom Equipe'!A:B,2,FALSE)","v":" "},72]
["Equipe N°73",0,{"$f":"VLOOKUP(A74,'Nom Prénom Equipe'!A:B,2,FALSE)","v":" "},73]
["Equipe N°74",0,{"$f":"VLOOKUP(A75,'Nom Prénom Equipe'!A:B,2,FALSE)","v":" "},74]
["Equipe N°75",0,{"$f":"VLOOKUP(A76,'Nom Prénom Equipe'!A:B,2,FALSE)","v":" "},75]
["Equipe N°76",0,{"$f":"VLOOKUP(A77,'Nom Prénom Equipe'!A:B,2,FALSE)","v":" "},76]
["Equipe N°77",0,{"$f":"VLOOKUP(A78,'Nom Prénom Equipe'!A:B,2,FALSE)","v":" "},77]
["Equipe N°78",0,{"$f":"VLOOKUP(A79,'Nom Prénom Equipe'!A:B,2,FALSE)","v":" "},78]
["Equipe N°79",0,{"$f":"VLOOKUP(A80,'Nom Prénom Equipe'!A:B,2,FALSE)","v":" "},79]
["Equipe N°80",0,{"$f":"VLOOKUP(A81,'Nom Prénom Equipe'!A:B,2,FALSE)","v":" "},80]
["Equipe N°81",0,{"$f":"VLOOKUP(A82,'Nom Prénom Equipe'!A:B,2,FALSE)","v":" "},81]
["Equipe N°82",0,{"$f":"VLOOKUP(A83,'Nom Prénom Equipe'!A:B,2,FALSE)","v":" "},82]
["Equipe N°83",0,{"$f":"VLOOKUP(A84,'Nom Prénom Equipe'!A:B,2,FALSE)","v":" "},83]
["Equipe N°84",0,{"$f":"VLOOKUP(A85,'Nom Prénom Equipe'!A:B,2,FALSE)","v":" "},84]
["Equipe N°85",0,{"$f":"VLOOKUP(A86,'Nom Prénom Equipe'!A:B,2,FALSE)","v":" "},85]
["Equipe N°86",0,{"$f":"VLOOKUP(A87,'Nom Prénom Equipe'!A:B,2,FALSE)","v":" "},86]
["Equipe N°87",0,{"$f":"VLOOKUP(A88,'Nom Prénom Equipe'!A:B,2,FALSE)","v":" "},87]
["Equipe N°88",0,{"$f":"VLOOKUP(A89,'Nom Prénom Equipe'!A:B,2,FALSE)","v":" "},88]
["Equipe N°89",0,{"$f":"VLOOKUP(A90,'Nom Prénom Equipe'!A:B,2,FALSE)","v":" "},89]
["Equipe N°90",0,{"$f":"VLOOKUP(A91,'Nom Prénom Equipe'!A:B,2,FALSE)","v":" "},90]
[null,0]
[null,0]
[null,0]
[null,0]
[null,0]
[null,0]
[null,0]
[null,0]
[null,0]
[null,0]

{"sheet":"Tirage 1,2 et 3 ème partie","index":7,"n_rows":46,"n_cols":9,"rows_kept":46,"cut":false,"hidden":false,"merged":[[0,1,0,2],[0,4,0,5],[0,7,0,8]]}
[null,"Première partie",null,null,"Deuxième partie",null,null,"Troisième partie"]
["Table n°1","Equipe n°1","Equipe n°2",null,"Equipe n°1","Equipe n°90",null,"Equipe n°1","Equipe n°88"]
["Table n°2","Equipe n°3","Equipe n°4",null,"Equipe n°3","Equipe n°2",null,"Equipe n°3","Equipe n°90"]
["Table n°3","Equipe n°5","Equipe n°6",null,"Equipe n°5","Equipe n°4",null,"Equipe n°5","Equipe n°2"]
["Table n°4","Equipe n°7","Equipe n°8",null,"Equipe n°7","Equipe n°6",null,"Equipe n°7","Equipe n°4"]
["Table n°5","Equipe n°9","Equipe n°10",null,"Equipe n°9","Equipe n°8",null,"Equipe n°9","Equipe n°6"]
["Table n°6","Equipe n°11","Equipe n°12",null,"Equipe n°11","Equipe n°10",null,"Equipe n°11","Equipe n°8"]
["Table n°7","Equipe n°13","Equipe n°14",null,"Equipe n°13","Equipe n°12",null,"Equipe n°13","Equipe n°10"]
["Table n°8","Equipe n°15","Equipe n°16",null,"Equipe n°15","Equipe n°14",null,"Equipe n°15","Equipe n°12"]
["Table n°9","Equipe n°17","Equipe n°18",null,"Equipe n°17","Equipe n°16",null,"Equipe n°17","Equipe n°14"]
["Table n°10","Equipe n°19","Equipe n°20",null,"Equipe n°19","Equipe n°18",null,"Equipe n°19","Equipe n°16"]
["Table n°11","Equipe n°21","Equipe n°22",null,"Equipe n°21","Equipe n°20",null,"Equipe n°21","Equipe n°18"]
["Table n°12","Equipe n°23","Equipe n°24",null,"Equipe n°23","Equipe n°22",null,"Equipe n°23","Equipe n°20"]
["Table n°13","Equipe n°25","Equipe n°26",null,"Equipe n°25","Equipe n°24",null,"Equipe n°25","Equipe n°22"]
["Table n°14","Equipe n°27","Equipe n°28",null,"Equipe n°27","Equipe n°26",null,"Equipe n°27","Equipe n°24"]
["Table n°15","Equipe n°29","Equipe n°30",null,"Equipe n°29","Equipe n°28",null,"Equipe n°29","Equipe n°26"]
["Table n°16","Equipe n°31","Equipe n°32",null,"Equipe n°31","Equipe n°30",null,"Equipe n°31","Equipe n°28"]
["Table n°17","Equipe n°33","Equipe n°34",null,"Equipe n°33","Equipe n°32",null,"Equipe n°33","Equipe n°30"]
["Table n°18","Equipe n°35","Equipe n°36",null,"Equipe n°35","Equipe n°34",null,"Equipe n°35","Equipe n°32"]
["Table n°19","Equipe n°37","Equipe n°38",null,"Equipe n°37","Equipe n°36",null,"Equipe n°37","Equipe n°34"]
["Table n°20","Equipe n°39","Equipe n°40",null,"Equipe n°39","Equipe n°38",null,"Equipe n°39","Equipe n°36"]
["Table n°21","Equipe n°41","Equipe n°42",null,"Equipe n°41","Equipe n°40",null,"Equipe n°41","Equipe n°38"]
["Table n°22","Equipe n°43","Equipe n°44",null,"Equipe n°43","Equipe n°42",null,"Equipe n°43","Equipe n°40"]
["Table n°23","Equipe n°45","Equipe n°46",null,"Equipe n°45","Equipe n°44",null,"Equipe n°45","Equipe n°42"]
["Table n°24","Equipe n°47","Equipe n°48",null,"Equipe n°47","Equipe n°46",null,"Equipe n°47","Equipe n°44"]
["Table n°25","Equipe n°49","Equipe n°50",null,"Equipe n°49","Equipe n°48",null,"Equipe n°49","Equipe n°46"]
["Table n°26","Equipe n°51","Equipe n°52",null,"Equipe n°51","Equipe n°50",null,"Equipe n°51","Equipe n°48"]
["Table n°27","Equipe n°53","Equipe n°54",null,"Equipe n°53","Equipe n°52",null,"Equipe n°53","Equipe n°50"]
["Table n°28","Equipe n°55","Equipe n°56",null,"Equipe n°55","Equipe n°54",null,"Equipe n°55","Equipe n°52"]
["Table n°29","Equipe n°57","Equipe n°58",null,"Equipe n°57","Equipe n°56",null,"Equipe n°57","Equipe n°54"]
["Table n°30","Equipe n°59","Equipe n°60",null,"Equipe n°59","Equipe n°58",null,"Equipe n°59","Equipe n°56"]
["Table n°31","Equipe n°61","Equipe n°62",null,"Equipe n°61","Equipe n°60",null,"Equipe n°61","Equipe n°58"]
["Table n°32","Equipe n°63","Equipe n°64",null,"Equipe n°63","Equipe n°62",null,"Equipe n°63","Equipe n°60"]
["Table n°33","Equipe n°65","Equipe n°66",null,"Equipe n°65","Equipe n°64",null,"Equipe n°65","Equipe n°62"]
["Table n°34","Equipe n°67","Equipe n°68",null,"Equipe n°67","Equipe n°66",null,"Equipe n°67","Equipe n°64"]
["Table n°35","Equipe n°69","Equipe n°70",null,"Equipe n°69","Equipe n°68",null,"Equipe n°69","Equipe n°66"]
["Table n°36","Equipe n°71","Equipe n°72",null,"Equipe n°71","Equipe n°70",null,"Equipe n°71","Equipe n°68"]
["Table n°37","Equipe n°73","Equipe n°74",null,"Equipe n°73","Equipe n°72",null,"Equipe n°73","Equipe n°70"]
["Table n°38","Equipe n°75","Equipe n°76",null,"Equipe n°75","Equipe n°74",null,"Equipe n°75","Equipe n°72"]
["Table n°39","Equipe n°77","Equipe n°78",null,"Equipe n°77","Equipe n°76",null,"Equipe n°77","Equipe n°74"]
["Table n°40","Equipe n°79","Equipe n°80",null,"Equipe n°79","Equipe n°78",null,"Equipe n°79","Equipe n°76"]
["Table n°41","Equipe n°81","Equipe n°82",null,"Equipe n°81","Equipe n°80",null,"Equipe n°81","Equipe n°78"]
["Table n°42","Equipe n°83","Equipe n°84",null,"Equipe n°83","Equipe n°82",null,"Equipe n°83","Equipe n°80"]
["Table n°43","Equipe n°85","Equipe n°86",null,"Equipe n°85","Equipe n°84",null,"Equipe n°85","Equipe n°82"]
["Table n°44","Equipe n°87","Equipe n°88",null,"Equipe n°87","Equipe n°86",null,"Equipe n°87","Equipe n°84"]
["Table n°45","Equipe n°89","Equipe n°90",null,"Equipe n°89","Equipe n°88",null,"Equipe n°89","Equipe n°86"]